{"text_format":"1","workbook":"xlsx","n_sheets":30,"sheets":["Stammdaten","Versionshinweis+§42f","2023","grafische D.","Januar","Februar","März","April","Mai","Juni","Juli","August","September","Oktober","November","Dezember","Impressum","Januar-Druck","Februar-Druck","März-Druck","April-Druck","Mai-Druck","Juni-Druck","Juli-Druck","August-Druck","September-Druck","Oktober-Druck","November-Druck","Dezember-Druck","INTERN"],"not_rendered":{"charts":2,"images":0,"macros":1,"external_links":0,"defined_names":28,"comments":0,"pivot_tables":0},"unopened":[{"sheet":"grafische D.","index":3,"reason":"not_a_worksheet"}],"bounds":{"document_bytes":16777216,"sheet_cells":100000,"rows_first":2000,"rows_last":500,"rows_between":2000,"halvings":0,"cell_chars":16384,"cell_head_chars":4096},"cells_cut":0,"cells_raw":0,"read":"whole","date_system":"1900"}

{"sheet":"Stammdaten","index":0,"n_rows":54,"n_cols":5,"rows_kept":54,"cut":false,"hidden":false,"merged":[[52,0,52,2],[53,0,53,2],[46,0,46,2],[51,0,51,2],[49,0,49,2],[48,0,48,2],[44,0,44,2],[43,0,43,2],[33,3,41,3],[0,0,0,2],[50,0,50,2],[47,0,47,2],[45,0,45,2]]}
["Angaben auf diesem Arbeitsblatt sind Voraussetzung für \nJahresplanung und AZ-Erfassung",null,null,null,"selbst ausfüllen"]
["Stundenkalkulation","Jahr",2023,null,"wird automatisch berechnet bzw. fester Wert"]
["Name MitarbeiterIn:"]
["Urlaubsanspruch",30]
["Resturlaub aus Vorjahr 1"]
["Zusatzurlaub (Schwerbehinderte MA) "]
["Urlaubsanspruch Gesamt",{"$f":"SUM(B4:B6)","v":30}]
["Überstunden/Fehlstunden aus Vorjahr2a"]
["Berechnung Stundenzahl (Jahr):"," "]
["Regeljahresarbeitszeit (1 VbE) 3",1716,"h"]
["Beschäftigungsumfang                                    Gesamt in %",75,"% Gesamt"]
["Religionsunterricht",null,"% Religionsunterricht"]
[null,null,"% im Arbeitsfeld I 4"]
[null,{"$f":"B11-B12-B13","v":75},"% im Arbeitsfeld II 4"]
["Beschäftigungsumfang ohne \"Religionsunterricht\" jedoch mit der Summe aus den Arbeitsfeldern I und II ",{"$f":"SUM(B13:B14)","v":75},"% Arbeitsfeld I + II"]
["Überstunden/Fehlstunden aus Vorjahr 2b",{"$f":"B8","v":0},"h"]
["Anzahl der Beschäftigungsmonate im Jahr 5",12]
["Zu leistende AZ (ohne RU und  Über-/ Fehlstunden)",{"$f":"((B10*(B13+B14))/100)/12*B17","v":1287},"h"]
["abzüglich Überstunden / zuzüglich Fehlstunden / Zusatzurlaub",{"$f":"B16+(B6*B31)","v":0},"h"]
["Veränderung  im laufendem Jahr 6",null,"%"]
["Anzahl der Monate für die die Veränderung gilt 6"]
["Stellenumfang in % für die folgenden Monate",{"$f":"B15+B20","v":75}]
["reguläre Wochenarbeitszeit (ohne RU)",{"$f":"(INTERN!A1*(Stammdaten!B22))/INTERN!A2","v":29.25}]
["reguläre Arbeitszeit je Tag (ohne RU)",{"$f":"B23/B30","v":5.85}]
[" ",{"$f":"((B10)/INTERN!A2*(B20/12))*B21","v":0},"h"]
["Zu leistende AZ (ohne RU)",{"$f":"B18-(B19)+(B25)","v":1287},"h"]
["Reguläre Wochen- / Tagesarbeitszeit"]
["reguläre Wochenarbeitszeit (laut Beschäftigungsumfang) 7",{"$f":"(INTERN!A1*Stammdaten!B11)/INTERN!A2","v":29.25},"h"]
["reguläre Wochenarbeitszeit GP und weitere Arbeitsfelder",{"$f":"(INTERN!A1*(Stammdaten!B13+B14))/INTERN!A2","v":29.25},"h"]
["Anzahl der regulären Arbeitstage je Woche 8",5,"d"]
["reguläre Arbeitszeit je Tag ohne RU",{"$f":"B29/B30","v":5.85},"h"]
[]
[null,"Anpassung der Dienstanweisung für das laufenden JAHR ","Werte entsprechend der geltenden Dienstanweisung 9"]
["1) Regelmäßige Veranstaltungen ",null,null,"ACHTUNG! Die Zahlen in der Spalte mit der Jahreszahl (Spalte B) bilden die Grundlagen für Monatstabellen im Modell B!"]
["2) Einzelveranstaltungen, Projekte, Freizeiten, besondere Dienste "]
["3) Gremien, Konvente"]
["4) Sonstige Dienstpflichten "]
["5) Entwicklung neuer Arbeitsansätze / Unvorhersehbares / seelsorgerische Begleitung Einzelner"]
["6) sonstige Arbeitsfelder (z.B. Kirchenmusik) "]
["Gesamt",{"$f":"SUM(B34:B39)","v":0}]
["Zu leistende AZ (ohne RU)",{"$f":"B26","v":1287},{"$f":"SUM(C34:C39)","v":0}]
["Prüfsumme 10",{"$f":"B40-B41","v":-1287}]
[]
["1 Anzahl der Resturlaubstage eintragen."]
["2a Hier werden nur die Überstunden (z.B. 10) oder die Fehlstunden (sind mit Minus anzugeben, z.B. -10) aus dem Vorjahr eingetragen. "]
["2b Hier werden automatisch nur die Überstunden (z.B. 10) oder die Fehlstunden aus dem Feld B7 übertragen. Das Feld wird GELB dargestellt, wenn der Überstundenwert mehr als 5% der zu leistenden Jahresarbeitszeit beträgt (Feld B17). (Laut KAVO ist eine Übernahme von  max. 5% Plusstunden möglich). Es muss entsprechend in der Zelle B7 auf maximal  5% reduziert werden. Alle Minusstunden werden immer ROT dargestellt. Hier erfolgt auch keine Kappung.\nACHTUNG: Die 5% berechnen sich für das aktuelle Jahr auf der Grundlage der Arbeitszeit des aktuellen und nicht des letzten Jahres. Berechnungsgrundlage muss eigentlich der Wert der AZ aus dem letzten Jahr sein. Bei einer Veränderung der Arbeitszeit im neuen Jahr, sind die 5% vom Wert des Vorjahrs zu berechnen."]
["3 Dieser Wert ist durch die KAVO vorgegeben. Die Stundenzahl für den Urlaub (30 x 8h) und die Feiertage wurden schon abgezogen. Die reguläre AZ beträgt somit 1716 h. (siehe auch Handreichung)\n"]
["4  \"Arbeitsfeld I\" könnte der gemeindepädagogische Dienst oder für die Kirchenmusiker die Kirchenmusik sein und \"Arbeitsfeld II\" ein weiterer Bereich (z.B. für die Kirchenmusiker die Gemeindepädagogik oder die MAV, ...). Damit soll sichergestellt werden, dass die Mitarbeitenden nicht mehrere AZ-Dokumentationen zu führen haben. Die Bezeichnung hierzu kann jeweils im Feld A12 und A 13 vorgenommen werden. Im MODELL B können diese Stunden getrennt in der Spalte M/N (Monatsblätter) dokumentiert werden. "]
["5  In der Regel 12 Monate. Bei Dienstanfang im Laufe des Jahres oder bei Beendigung der Beschäftigung vor Ablauf des Jahres ist entsprechend die Monatszahl anzupassen."]
["6 Diese Angaben sind bei der Jahresplanung in der Regel nicht notwendig. Erst im Verlauf des Jahres, wenn sich Veränderungen des  Beschäftigungsumfangs ergeben, werden hier die veränderten (zusätzlichen oder verringerten) Anstellungsprozente und die Anzahl der Geltungsmonate eingetragen. Sollte sich z.B. der Stellenumfang um 10 % erhöhen, kann hier die Zahl 10 eingetragen werden (bei Verringerung des Arbeitsumfangs analog eine -10). Entsprechend ändern sich prozentual die Jahresarbeitszeit (Feld B27) und die tägliche Arbeitszeit (Feld B20). ACHTUNG: Die durchschnittliche tägliche AZ erhöht bzw. verringert sich. Dies wird aus technischen Gründen auch rückwirkend für die Monate ausgeführt. Z.B. würden dann alle Krankheitstage mit mehr oder weiger Zeit berechnet werden. Um dies auszuschließen,  wird folgende Vorgehensweise empfohlen:  In den Monatsblättern vor der gültigen Veränderung muss die bis dahin güitige tägliche AZ (B20) jeweils übertragen werden - z.B. Januar - Feld: R/S 1. In den Monaten, ab dem die Veränderung gilt, muss nichts nachgetragen werden.  Das Feld R/S 1 ist in den jeweiligen Monatsblättern deshalb nicht mit einer Sperre versehen und somit beschreibbar."]
["7 Entsprechend der Regelung im Arbeitsvertrag (z.B. 40 h bei 100% Anstellung; 24 h bei 60%)."]
["8 Im Normalfall haben alle Mitarbeitenden eine 5-Tage-Woche. Dies wird z.B. deutlich in der Anzahl der Urlaubstage (30 Tage Urlaub= 5-Tage-Woche). Bestehende Sonderregelungen (z.B. bei Teilzeitbeschäftigten) müssen hier berücksichtigt werden (1-, 2-, 3- oder 4-Tage-Woche). Eine Regelung dazu gibt es in der KAVO. \n§ 27: Erholungsurlaub\n( 1 ) 1 Beschäftigte haben in jedem Kalenderjahr Anspruch auf Erholungsurlaub unter Fortzahlung des Entgelts (§ 21). 2 Bei Verteilung der wöchentlichen Arbeitszeit auf fünf Tage in der Kalenderwoche beträgt der Urlaubsanspruch in jedem Kalenderjahr einheitlich 30 Arbeitstage. 3 Bei einer anderen Verteilung der wöchentlichen Arbeitszeit als auf fünf Tage in der Woche erhöht oder vermindert sich der Urlaubsanspruch entsprechend. 4 Verbleibt bei der Berechnung des Urlaubs ein Bruchteil, der mindestens einen halben Urlaubstag ergibt, wird er auf einen vollen Urlaubstag aufgerundet; Bruchteile von weniger als einem halben Urlaubstag bleiben unberücksichtigt....."]
["9  In die Spalte DIENSTANWEISUNG sind die Werte aus der Arbeitsplatzbeschreibung der DA zu übertragen. Sie gelten als Vergleichszahl. In die linke Spalte daneben werden die Werte für das laufende Jahr eingetragen. Diese können von der DA abweichen. Dies geschieht z.B.  bei dem Übertrag von Plusstunden. (Die Berechung hierfür erfolgt im Feld B25.)"]
["10 Prüfsumme muss NULL ergeben (B39-B40); B39 entspricht B26 - der berechneten SOLL-JAZ."]

{"sheet":"Versionshinweis+§42f","index":1,"n_rows":98,"n_cols":4,"rows_kept":98,"cut":false,"hidden":false,"merged":[]}
["Versionshinweise"]
[null,"Datum","Veränderung zur vorherigen Version","Hinweise"]
["2023-V2","2023-01-09","Der 1. Juni begann in V1 fälschlicherweise schon am Mittwoch. "]
["2023-V_1","2022-12-06","Anpassung an das Kalenderjahr 2023; "]
["2020 -V_1","2019-11-15","Anpassung an das Kalenderjahr 2020; "]
["2019\nV_2","2018-12-10","Fehlerkorrektur im Dezember Zelle  w12","Bei Bedarf kann dies auch selbstständig in Version v-1 geändert werden. 1.\tBitte im Monat Dezember den Blattschutz aufheben. \nHierzu muss auf das Arbeitsblatt/Reiter „Dezember“ (am unteren Bildschirmrand) geklickt werden. Dort erscheint ein Menü  Blattschutz aufheben. \n2.\tIn die Zelle W12 (Monat Dezember) klicken.\n3.\tDie Formel entsprechend ändern:\na.\tALT:  =November!U5/11 ersetzen durch \nb.\tNEU:  =November!W44-Dezember!V12"]
["2019\nV_1","2019-11-17","1. Angepasst für Kalenderjahr 2019\n2. Es wurde eine zusätzliche druckfertige Darstellung der Monate hinzugefügt (neue Arbeitsblätter \"Monat-Druck\"). Diese Arbeitsblätter generieren sich selber.\n3. Die Prognose, die 2018 ab September jeweils am Ende der Monate zu sehen war, wurde jetzt auch im Juli und August hinzugefügt.\n4. In der \"Spalte Z\" (in den Monatsblättern) wurde eine Plausibilitätsprüfung eingefügt. Diese weißt darauf hin, wenn AZ während Krankheit oder Urlaub eingetragen wurde. \n5. Im Blatt \"Stammblatt\" (B 6)  kann jetzt auch Zusatzurlaub im Sinne des SGB IX (Schwerbehinderte)  berücksichtigt werden. Dieser wird von der Soll-AZ abgezogen und wird dann wie Urlaub behandelt.\n6. In allen Arbeitsblättern wurde ein Druckbereich festgelegt, der sich jeweils auf die notwendigen Zellen bezieht."]
[2018,"2.0","Ab Version 2.0 ist die Datei auch mit NUMBERS von Apple benutzbar. Allerdings wird bei NUMBERS der Blattschutz entfernt.  Die reduzierte Darstellung des Modell A ist mit Numbers auch nicht darstellbar. Es werden immer alle Spalten des Modell B mit angezeigt. ","Für Mac-NUMBERS ist die Version 2.0 Voraussetzung für eine Nutzung.\nACHTUNG: Bei der Verwendung von NUMBERS wird der Blattschutz aufgehoben und einige Funktionen aus dem Bereich der Formatierungen werden entfernt. So wird z.B. die Beschränkung bei den Urlaubs- und Krankheitstagen auf die Zahl \"1\" entfernt. Auch die gesperrten Wochenenden sind überschreibbar.\nBITTE: Bei der Verwendung von NUMBERS besonders sorgfältig sein, damit keine Formeln überschrieben werden. "]
[]
[]
[]
[]
[]
[]
[]
[]
["§ 42",null,"https://www.kirchenrecht-ekm.de/document/13574/search/720#s47000067 "]
["Sonderregelung für Beschäftigte im gemeindepädagogischen Dienst"]
["Nr. 1"]
["Zu § 1 – Geltungsbereich –"]
["1 Diese Sonderregelung gilt für Beschäftigte im gemeindepädagogischen Dienst. 2 Zur Festlegung der einzelnen Dienstverpflichtungen für Beschäftigte im gemeindepädagogischen Dienst ist eine Dienstanweisung zu erstellen. 3 Hierfür ist das von der jeweiligen landeskirchlichen Fachaufsicht erstellte Muster zu verwenden. 4 Im Übrigen gelten die jeweiligen landeskirchlichen Vorschriften. 5 Die Nummern 3 bis 6 finden keine Anwendung für den Einsatz der Beschäftigten des gemeindepädagogischen Dienstes im Religionsunterricht."]
["Nr. 2"]
["Zu § 3 – Allgemeine Pflichten –"]
["1 Die Beschäftigten sind gehalten, sich im Rahmen der jeweils geltenden Vorschriften zur Fort- und Weiterbildung regelmäßig fortzubilden. 2 Sofern nicht durch Rechtsvorschrift oder Vertrag geregelt, haben Dienstgeber die notwendigen Kosten und Auslagen zu erstatten, soweit die Übernahme zugesagt wurde."]
["Nr. 3"]
["Zu § 6 – Regelmäßige Arbeitszeit –"]
["( 1 ) 1 Es gilt eine Jahresarbeitszeit, die jeweils für die Zeit vom 1. Januar bis zum 31. Dezember eines Jahres schriftlich in einem Jahresarbeitszeitkonto festzuhalten ist. 2 Bei Vollbeschäftigten beträgt die Jahresarbeitszeit 1760 Stunden, ab dem Jahr 2023 1716 Stunden. "]
["( 2 ) 1 Das Arbeitszeitguthaben kann im Umfang von bis zu 5 Prozent der Jahresarbeitszeit in das Folgejahr übertragen werden. 2 Eine darüberhinausgehende Übertragung von Arbeitszeitguthaben findet nicht statt. 3 Im Einzelfall können Vereinbarungen getroffen werden, die von Nr. 3 Absatz 2 Satz 2 abweichen. 4 Sie bedürfen der Schriftform."]
["( 3 ) § 6 Absatz 2, 3, 4 und 6 finden keine Anwendung."]
["( 4 ) 1 Für jeden Tag, an dem Vollzeitbeschäftigte freigestellt oder arbeitsunfähig sind, werden pauschal 8 Stunden bzw. die nach § 30 KAVO EKD-Ost genannten Ausmaße dem Arbeitszeitkonto gutgeschrieben. 2 Für Teilzeitbeschäftigte gilt § 24 Absatz 2 entsprechend. "]
["( 5 ) 1 Die Arbeitsstelle ergibt sich aus einem bestimmten örtlichen Bereich, der der/dem Beschäftigten zugewiesen wird. 2 Die tägliche Arbeitszeit beginnt mit der Arbeitsaufnahme an einem Ort innerhalb dieses Bereichs; sie endet bei Beendigung der Arbeit an einem Ort innerhalb dieses Bereichs. 3 Die Zeiten für Ortswechsel innerhalb des örtlichen Bereichs, die dienstlich veranlasst sind, insbesondere die Fahrzeit, werden als Arbeitszeit erfasst. 4 Liegen das Ende eines dienstlichen Termins und der Beginn des folgenden dienstlichen Termins mehr als eine Stunde auseinander, so gilt der Dienst als geteilt mit der Folge, dass die Zeit zwischen beiden Terminen nicht als Arbeitszeit erfasst wird; das gilt nicht für die durch den direkten Ortswechsel veranlasste Fahrzeit."]
["( 6 ) Es ist mindestens ein freier Arbeitstag pro Woche festzulegen. Zudem ist ein Sonntag pro Quartal arbeitsfrei zu halten."]
["Anmerkung zu Nr. 3 Absatz 6:"]
["In der Regel gilt eine Fünf-Tage-Woche."]
["( 7 ) 1 Bei eintägigen Freizeiten/Rüstzeiten zählt die tatsächliche dienstliche Inanspruchnahme als Arbeitszeit. 2 Bei mehrtägigen Freizeiten/Rüstzeiten wird für die Tage, zwischen dem An- und Abreisetag eine Arbeitszeit von 12 Stunden gutgeschrieben. "]
["1 Liegt der Reisebeginn am Anreisetag"]
["-","vor 8.00 Uhr","werden 12 Stunden"]
["-","zwischen 8.00 Uhr und 11.00 Uhr ","werden 10 Stunden "]
["-","zwischen 11.00 Uhr und 14.00 Uhr","werden 8 Stunden"]
["-","nach 14.00 Uhr","werden 6 Stunden"]
["als Arbeitszeit gutgeschrieben."]
["4 Liegt das Reiseende am Abreisetag"]
["-","vor 14.00 Uhr","werden 6 Stunden"]
["-","zwischen 14.00 Uhr und 17.00 Uhr ","werden 8 Stunden "]
["-","zwischen 17.00 Uhr und 20.00 Uhr","werden 10 Stunden"]
["-","nach 20.00 Uhr","werden 12 Stunden"]
["als Arbeitszeit gutgeschrieben."]
["Nr. 4"]
["Zu § 8 – Ausgleich für Sonderformen der Arbeit –"]
["( 1 ) § 8 Absatz 1 und Absatz 5 finden keine Anwendung."]
["( 2 ) 1 Der Zeitausgleich aus Zeitguthaben soll innerhalb von drei Monaten nach Antragstellung gewährt werden. 2 Sofern dies aus dienstlichen Gründen nicht möglich ist, wird der Geldwert dieser Arbeitsstunden berechnet und kommt mit der nächsten Entgeltabrechnung zur Auszahlung. "]
["Anmerkung zu Nr. 4 Absatz 2 Satz 2:"]
["Nr. 3 Absatz 2 bleibt unberührt."]
["Nr. 5"]
["Zu § 27 – Urlaub –"]
["§ 27 findet mit der Maßgabe Anwendung, dass Urlaub grundsätzlich nur in den Schulferien genommen werden kann."]
["Nr. 6 "]
["Gliedkirchlich können zusätzliche oder abweichende Regelungen hierzu erlassen werden."]
[]
["§ 43"]
["Sonderregelung für Beschäftigte im kirchenmusikalischen Dienst"]
["Nr. 1"]
["Zu § 1 – Geltungsbereich –"]
["Diese Sonderregelung gilt für Beschäftigte im kirchenmusikalischen Dienst. "]
["Nr. 2"]
["Zu § 3 – Allgemeine Pflichten –"]
["( 1 ) Beschäftigte im kirchenmusikalischen Dienst haben im Dienst, insbesondere im Gottesdienst und bei Amtshandlungen, eine angemessene Kleidung zu tragen."]
["( 2 ) Wird vom Dienstgeber das Tragen besonderer Kleidung insbesondere nach festgelegtem Muster während des Dienstes angeordnet, sind die notwendigen Kosten von diesem zu übernehmen."]
["( 3 ) 1 Die Beschäftigten sind gehalten, sich regelmäßig fortzubilden. 2 Die Teilnahme an Kirchenmusikkonventen, kirchenmusikalischen Arbeitstagungen, Fortbildungskursen und Singwochen wird erwartet."]
["( 4 ) Die notwendigen Auslagen sind vom Dienstgeber zu erstatten, soweit er die Übernahme zugesagt hat."]
["Nr. 3"]
["Zu § 6 – Regelmäßige Arbeitszeit – "]
["( 1 ) 1 Es gilt eine Jahresarbeitszeit, die jeweils für die Zeit vom 1. Januar bis zum 31. Dezember eines Jahres schriftlich in einem Jahresarbeitszeitkonto festzuhalten ist. 2 Bei Vollbeschäftigten beträgt die Jahresarbeitszeit 1760 Stunden, ab dem Jahr 2023 1716 Stunden. "]
["( 2 ) 1 Das Arbeitszeitguthaben kann im Umfang von bis zu 5 Prozent der Jahresarbeitszeit in das Folgejahr übertragen werden. 2 Eine darüberhinausgehende Übertragung von Arbeitszeitguthaben findet nicht statt. 3 Im Einzelfall können Vereinbarungen getroffen werden, die von Nr. 3 Absatz 2 Satz 2 abweichen. 4 Sie bedürfen der Schriftform."]
["( 3 ) § 6 Absatz 2, 3, 4 und 6 finden keine Anwendung."]
["( 4 ) 1 Für jeden Tag, an dem Vollzeitbeschäftigte freigestellt oder arbeitsunfähig sind, werden pauschal 8 Stunden bzw. die nach § 30 KAVO EKD-Ost genannten Ausmaße dem Arbeitszeitkonto gutgeschrieben. 2 Für Teilzeitbeschäftigte gilt § 24 Absatz 2 entsprechend. "]
["( 5 ) 1 Die Arbeitsstelle ergibt sich aus einem bestimmten örtlichen Bereich, der der/dem Beschäftigten zugewiesen wird. 2 Die tägliche Arbeitszeit beginnt mit der Arbeitsaufnahme an einem Ort innerhalb dieses Bereichs; sie endet bei Beendigung der Arbeit an einem Ort innerhalb dieses Bereichs. 3 Die Zeiten für Ortswechsel innerhalb des örtlichen Bereichs, die dienstlich veranlasst sind, insbesondere die Fahrzeit, werden als Arbeitszeit erfasst. 4 Liegen das Ende eines dienstlichen Termins und der Beginn des folgenden dienstlichen Termins mehr als eine Stunde auseinander, so gilt der Dienst als geteilt mit der Folge, dass die Zeit zwischen beiden Terminen nicht als Arbeitszeit erfasst wird; das gilt nicht für die durch den direkten Ortswechsel veranlasste Fahrzeit."]
["( 6 ) 1 Es ist mindestens ein freier Arbeitstag pro Woche festzulegen. 2 Zudem ist ein Sonntag pro Quartal arbeitsfrei zu halten."]
["Anmerkung zu Nr. 3 Absatz 6:"]
["In der Regel gilt eine Fünf-Tage-Woche."]
["( 7 ) 1 Bei eintägigen Freizeiten/Rüstzeiten zählt die tatsächliche dienstliche Inanspruchnahme als Arbeitszeit. 2 Bei mehrtägigen Freizeiten/Rüstzeiten wird für die Tage, zwischen dem An- und Abreisetag eine Arbeitszeit von 12 Stunden gutgeschrieben. "]
["3 Liegt der Reisebeginn am Anreisetag"]
["-","vor 8.00 Uhr","werden 12 Stunden"]
["-","zwischen 8.00 Uhr und 11.00 Uhr ","werden 10 Stunden "]
["-","zwischen 11.00 Uhr und 14.00 Uhr","werden 8 Stunden"]
["-","nach 14.00 Uhr","werden 6 Stunden"]
["als Arbeitszeit gutgeschrieben."]
["4 Liegt das Reiseende am Abreisetag"]
["-","vor 14.00 Uhr","werden 6 Stunden"]
["-","zwischen 14.00 Uhr und 17.00 Uhr ","werden 8 Stunden "]
["-","zwischen 17.00 Uhr und 20.00 Uhr","werden 10 Stunden"]
["-","nach 20.00 Uhr","werden 12 Stunden"]
["als Arbeitszeit gutgeschrieben."]
["Nr. 4"]
["Zu § 8 – Ausgleich für Sonderformen der Arbeit –"]
["1 Der Zeitausgleich aus Zeitguthaben soll innerhalb von drei Monaten nach Antragstellung gewährt werden. 2 Sofern dies aus dienstlichen Gründen nicht möglich ist, wird der Geldwert dieser Mehrarbeitsstunden berechnet und kommt mit der nächsten Entgeltabrechnung zur Auszahlung. "]
["Anmerkung zu Nr. 4 Satz 2:"]
["Nr. 3 Absatz 2 bleibt unberührt."]

{"sheet":"2023","index":2,"n_rows":26,"n_cols":10,"rows_kept":26,"cut":false,"hidden":false,"merged":[[22,1,22,2]]}
[]
["Name ",{"$f":"Stammdaten!B3","v":0},{"$f":"Stammdaten!C2","v":2023},"Urlaubs-anspruch (d):",{"$f":"Stammdaten!B4+Stammdaten!B6","v":30},null,"Resturlaub (Vorjahr) (d):",{"$f":"Stammdaten!B5","v":0},"Resturlaub (Folgejahr) (d):",{"$f":"Dezember!Q5","v":30}]
[]
[null,"Jahres-arbeitszeit (GP)",{"$f":"Stammdaten!B26","v":1287},"Reguläre tägliche Arbeitszeit (h):",{"$f":"Stammdaten!B31","v":5.85},null,"IST-Arbeitszeit (h):",{"$f":"Dezember!U5","v":0},"Übertrag der Minus- oder Plusstunden in das Folgejahr zum Jahresende (h):",{"$f":"H4-C4","v":-1287}]
[]
["Hier die Arbeitsfelder eintragen / Erscheinen dann in den Monatsblättern","1) Regelmäßige Veranstaltungen ","2) Einzelveranstaltungen, Projekte, Freizeiten, besondere Dienste ","3) Gremien, Konvente","4) Sonstige Dienstpflichten ","5) Entwicklung neuer Arbeitsansätze / Unvorhersehbares / seelsorgerische Begleitung Einzelner","6) sonstige Arbeitsfelder (z.B. Kirchenmusik) ","Tagesarbeitszeit","Krankheit / Sonderurlaub /  Personen bezogene Freistellung","Summe"]
["SOLL",{"$f":"Stammdaten!B34","v":0},{"$f":"Stammdaten!B35","v":0},{"$f":"Stammdaten!B36","v":0},{"$f":"Stammdaten!B37","v":0},{"$f":"Stammdaten!B38","v":0},{"$f":"Stammdaten!B39","v":0},{"$f":"SUM(B7:F7)","v":0},null,{"$f":"Stammdaten!B26","v":1287}]
["IST",{"$f":"SUM(B10:B21)","v":0},0,0,0,0,{"$f":"SUM(G10:G21)","v":0},0,{"$f":"SUM(I10:I21)","v":0},{"$f":"SUM(B8:I8)","v":0}]
["Differenz",{"$f":"B8-B7","v":0},0,0,0,0,0,0,null,{"$f":"J7-J8","v":1287}]
["Januar",{"$f":"Januar!D45","v":0},{"$f":"Januar!F45","v":0},{"$f":"Januar!H45","v":0},{"$f":"Januar!J45","v":0},{"$f":"Januar!L45","v":0},{"$f":"Januar!N45","v":0},{"$f":"Januar!P45","v":0},{"$f":"Januar!S45","v":0},{"$f":"SUM(B10:I10)","v":0}]
["Februar",{"$f":"Februar!D45","v":0},{"$f":"Februar!F45","v":0},{"$f":"Februar!H45","v":0},{"$f":"Februar!J45","v":0},{"$f":"Februar!L45","v":0},{"$f":"Februar!N45","v":0},{"$f":"Februar!P45","v":0},{"$f":"Februar!S45","v":0},{"$f":"SUM(B11:I11)","v":0}]
["März",{"$f":"März!D45","v":0},{"$f":"März!F45","v":0},{"$f":"März!H45","v":0},{"$f":"März!J45","v":0},{"$f":"März!L45","v":0},{"$f":"März!N45","v":0},{"$f":"März!P45","v":0},{"$f":"März!S45","v":0},0]
["April",{"$f":"April!D45","v":0},{"$f":"April!F45","v":0},{"$f":"April!H45","v":0},{"$f":"April!J45","v":0},{"$f":"April!L45","v":0},{"$f":"April!N45","v":0},{"$f":"April!P45","v":0},{"$f":"April!S45","v":0},0]
["Mai",{"$f":"Mai!D45","v":0},{"$f":"Mai!F45","v":0},{"$f":"Mai!H45","v":0},{"$f":"Mai!J45","v":0},{"$f":"Mai!L45","v":0},{"$f":"Mai!N45","v":0},{"$f":"Mai!P45","v":0},{"$f":"Mai!S45","v":0},0]
["Juni",{"$f":"Juni!D45","v":0},{"$f":"Juni!F45","v":0},{"$f":"Juni!H45","v":0},{"$f":"Juni!J45","v":0},{"$f":"Juni!L45","v":0},{"$f":"Juni!N45","v":0},{"$f":"Juni!P45","v":0},{"$f":"Juni!S45","v":0},0]
["Juli",{"$f":"Juli!D45","v":0},{"$f":"Juli!F45","v":0},{"$f":"Juli!H45","v":0},{"$f":"Juli!J45","v":0},{"$f":"Juli!L45","v":0},{"$f":"Juli!N45","v":0},{"$f":"Juli!P45","v":0},{"$f":"Juli!S45","v":0},0]
["August",{"$f":"August!D45","v":0},{"$f":"August!F45","v":0},{"$f":"August!H45","v":0},{"$f":"August!J45","v":0},{"$f":"August!L45","v":0},{"$f":"August!N45","v":0},{"$f":"August!P45","v":0},{"$f":"August!S45","v":0},0]
["September",{"$f":"September!D45","v":0},{"$f":"September!F45","v":0},{"$f":"September!H45","v":0},{"$f":"September!J45","v":0},{"$f":"September!L45","v":0},{"$f":"September!N45","v":0},{"$f":"September!P45","v":0},{"$f":"September!S45","v":0},0]
["Oktober",{"$f":"Oktober!D45","v":0},{"$f":"Oktober!F45","v":0},{"$f":"Oktober!H45","v":0},{"$f":"Oktober!J45","v":0},{"$f":"Oktober!L45","v":0},{"$f":"Oktober!N45","v":0},{"$f":"Oktober!P45","v":0},{"$f":"Oktober!S45","v":0},0]
["November",{"$f":"November!D45","v":0},{"$f":"November!F45","v":0},{"$f":"November!H45","v":0},{"$f":"November!J45","v":0},{"$f":"November!L45","v":0},{"$f":"November!N45","v":0},{"$f":"November!P45","v":0},{"$f":"November!S45","v":0},0]
["Dezember",{"$f":"Dezember!D45","v":0},{"$f":"Dezember!F45","v":0},{"$f":"Dezember!H45","v":0},{"$f":"Dezember!J45","v":0},{"$f":"Dezember!L45","v":0},{"$f":"Dezember!N45","v":0},{"$f":"Dezember!P45","v":0},{"$f":"Dezember!S45","v":0},0]
[]
[null,{"$f":"Stammdaten!C2","v":2023}]
[null,"IST",{"$f":"Dezember!U5","v":0}]
[null,"SOLL",{"$f":"Stammdaten!B26","v":1287}]
[null,"Differenz",{"$f":"C24-C25","v":-1287}]

{"sheet":"Januar","index":4,"n_rows":52,"n_cols":26,"rows_kept":52,"cut":false,"hidden":false,"merged":[[19,22,24,22],[26,23,31,23],[33,21,38,21],[50,0,50,24],[19,23,24,23],[33,23,38,23],[26,22,31,22],[26,10,26,11],[40,21,42,21],[40,22,42,22],[19,21,24,21],[30,10,30,11],[26,21,31,21],[31,10,31,11],[34,12,34,13],[24,16,25,18],[31,16,32,18],[38,16,39,18],[25,8,25,9],[31,8,31,9],[41,10,41,11],[39,10,39,11],[40,10,40,11],[33,8,33,9],[5,23,10,23],[12,21,17,21],[12,22,17,22],[12,23,17,23],[25,10,25,11],[33,12,33,13],[33,22,38,22],[35,10,35,11],[35,12,35,13],[34,14,34,15],[5,22,10,22],[10,16,11,18],[17,16,18,18],[5,21,10,21],[36,10,36,11],[37,10,37,11],[34,10,34,11],[33,10,33,11],[32,12,32,13],[28,10,28,11],[21,10,21,11],[24,10,24,11],[29,10,29,11],[20,10,20,11],[0,0,0,11],[3,2,3,3],[3,4,3,5],[4,6,4,7],[1,0,1,13],[3,0,3,1],[12,10,12,11],[30,8,30,9],[16,10,16,11],[17,10,17,11],[27,8,27,9],[12,8,12,9],[13,8,13,9],[14,8,14,9],[19,8,19,9],[20,8,20,9],[11,10,11,11],[23,10,23,11],[15,10,15,11],[13,10,13,11],[27,10,27,11],[22,10,22,11],[4,0,4,1],[4,10,4,11],[32,10,32,11],[41,6,41,7],[35,6,35,7],[39,6,39,7],[38,6,38,7],[37,6,37,7],[36,6,36,7],[40,8,40,9],[41,8,41,9],[34,8,34,9],[35,8,35,9],[36,8,36,9],[37,8,37,9],[38,8,38,9],[39,8,39,9],[38,10,38,11],[16,8,16,9],[17,8,17,9],[18,8,18,9],[32,8,32,9],[26,6,26,7],[20,6,20,7],[16,6,16,7],[27,6,27,7],[22,6,22,7],[23,6,23,7],[24,6,24,7],[21,8,21,9],[22,8,22,9],[23,8,23,9],[26,8,26,9],[24,8,24,9],[28,8,28,9],[29,8,29,9],[9,6,9,7],[33,6,33,7],[40,6,40,7],[29,6,29,7],[34,6,34,7],[17,6,17,7],[18,6,18,7],[30,6,30,7],[31,6,31,7],[32,6,32,7],[25,6,25,7],[21,6,21,7],[28,6,28,7],[19,6,19,7],[38,2,38,3],[39,2,39,3],[30,4,30,5],[31,4,31,5],[32,4,32,5],[33,4,33,5],[39,4,39,5],[34,4,34,5],[22,2,22,3],[28,2,28,3],[29,2,29,3],[19,4,19,5],[20,4,20,5],[21,4,21,5],[19,2,19,3],[20,2,20,3],[21,2,21,3],[23,2,23,3],[24,2,24,3],[30,2,30,3],[25,2,25,3],[22,4,22,5],[23,4,23,5],[24,4,24,5],[25,4,25,5],[26,4,26,5],[27,4,27,5],[6,10,6,11],[7,10,7,11],[8,10,8,11],[9,10,9,11],[10,2,10,3],[10,4,10,5],[10,6,10,7],[6,8,6,9],[7,8,7,9],[8,8,8,9],[9,8,9,9],[10,8,10,9],[10,10,10,11],[6,4,6,5],[7,4,7,5],[8,4,8,5],[9,4,9,5],[6,2,6,3],[7,2,7,3],[8,2,8,3],[9,2,9,3],[6,6,6,7],[7,6,7,7],[8,6,8,7],[2,2,2,3],[2,4,2,5],[2,6,2,7],[2,8,2,9],[2,10,2,11],[4,2,4,3],[4,4,4,5],[4,8,4,9],[5,10,5,11],[5,2,5,3],[5,8,5,9],[3,6,3,7],[3,8,3,9],[3,10,3,11],[5,4,5,5],[5,6,5,7],[8,14,8,15],[8,12,8,13],[14,14,14,15],[15,14,15,15],[16,14,16,15],[17,14,17,15],[14,12,14,13],[15,12,15,13],[16,12,16,13],[17,12,17,13],[9,14,9,15],[9,12,9,13],[10,12,10,13],[13,14,13,15],[18,14,18,15],[11,2,11,3],[11,14,11,15],[12,14,12,15],[17,2,17,3],[18,2,18,3],[13,2,13,3],[14,2,14,3],[15,2,15,3],[16,2,16,3],[13,4,13,5],[12,2,12,3],[11,4,11,5],[12,4,12,5],[11,6,11,7],[12,12,12,13],[13,12,13,13],[15,6,15,7],[14,4,14,5],[15,4,15,5],[16,4,16,5],[18,4,18,5],[17,4,17,5],[15,8,15,9],[51,0,51,24],[48,0,48,24],[42,14,42,15],[27,14,27,15],[28,14,28,15],[41,14,41,15],[37,14,37,15],[32,14,32,15],[33,14,33,15],[38,12,38,13],[31,2,31,3],[34,2,34,3],[35,2,35,3],[32,2,32,3],[44,23,45,24],[44,19,45,22],[40,23,42,23],[40,4,40,5],[41,4,41,5],[38,4,38,5],[43,6,43,7],[46,0,46,24],[39,12,39,13],[29,14,29,15],[2,17,2,18],[3,14,3,15],[4,14,4,15],[5,14,5,15],[6,14,6,15],[7,14,7,15],[10,14,10,15],[49,0,49,24],[19,14,19,15],[20,14,20,15],[21,14,21,15],[22,14,22,15],[30,14,30,15],[40,14,40,15],[23,14,23,15],[24,14,24,15],[38,14,38,15],[36,14,36,15],[39,14,39,15],[26,14,26,15],[25,14,25,15],[35,14,35,15],[31,14,31,15],[47,0,47,24],[42,12,42,13],[43,12,43,13],[42,8,42,9],[43,8,43,9],[42,10,42,11],[43,4,43,5],[43,14,43,15],[42,6,42,7],[42,2,42,3],[43,2,43,3],[42,4,42,5],[43,10,43,11],[40,12,40,13],[41,12,41,13],[26,12,26,13],[26,2,26,3],[27,2,27,3],[37,12,37,13],[33,2,33,3],[36,12,36,13],[24,12,24,13],[25,12,25,13],[27,12,27,13],[28,12,28,13],[29,12,29,13],[30,12,30,13],[31,12,31,13],[28,4,28,5],[29,4,29,5],[41,2,41,3],[40,2,40,3],[35,4,35,5],[37,4,37,5],[36,4,36,5],[36,2,36,3],[37,2,37,3],[23,12,23,13],[12,6,12,7],[11,8,11,9],[14,10,14,11],[13,6,13,7],[0,21,0,25],[1,21,1,25],[19,12,19,13],[19,10,19,11],[18,10,18,11],[14,6,14,7],[20,12,20,13],[21,12,21,13],[22,12,22,13],[11,12,11,13],[2,12,2,13],[3,12,3,13],[4,12,4,13],[5,12,5,13],[6,12,6,13],[7,12,7,13],[18,12,18,13],[0,17,0,18],[0,14,0,16]]}
[{"$f":"Stammdaten!B3","v":0},null,null,null,null,null,null,null,null,null,null,null,null,null,"reguläre tägliche AZ im GP-Dienst/ Kirchenmusik (Stunden)",null,null,{"$f":"Stammdaten!B31","v":5.85},null,"SOLL-AZ  im GP/KM-Dienst (Stunden)",{"$f":"Stammdaten!B26","v":1287},"JANUAR"]
[null,null,null,null,null,null,null,null,null,null,null,null,null,null,"a)  Angaben in Stunden (Bsp. 1,00=60min; 1,5=90min; 0,75=45min; 0,25=15min)",null,null,null,null,null,null,"b)  Die Felder in dieser Farbe werden automatisch ausgefüllt."]
[null,"Tag",{"$f":"'2023'!B6","v":"1) Regelmäßige Veranstaltungen "},null,{"$f":"'2023'!C6","v":"2) Einzelveranstaltungen, Projekte, Freizeiten, besondere Dienste "},null,{"$f":"'2023'!D6","v":"3) Gremien, Konvente"},null,{"$f":"'2023'!E6","v":"4) Sonstige Dienstpflichten "},null,{"$f":"'2023'!F6","v":"5) Entwicklung neuer Arbeitsansätze / Unvorhersehbares / seelsorgerische Begleitung Einzelner"},null,{"$f":"'2023'!G6","v":"6) sonstige Arbeitsfelder (z.B. Kirchenmusik) "},null,{"$f":"'2023'!H6","v":"Tagesarbeitszeit"},"siehe 1","Urlaub - Tag je als 1 eintragen  2","Krankheit und weitere personenbezogene  Freistellungen - Tag je als \"1\" eintragen 3",null,"Ort 4","geleistete AZ 5","geleistete Wochenstunden","Restarbeitszeit Jahr","verbleibende AZ im Jahr in Prozent","Anmerkung / Hinweis / Begründung 6","Plausibilitätsprüfung "]
["JAHR-SOLL",null,{"$f":"Stammdaten!B34","v":0},null,{"$f":"Stammdaten!B35","v":0},null,{"$f":"Stammdaten!B36","v":0},null,{"$f":"Stammdaten!B37","v":0},null,{"$f":"Stammdaten!B38","v":0},null,{"$f":"Stammdaten!B39","v":0},null,{"$f":"Stammdaten!B26","v":1287},null,{"$f":"Stammdaten!B7","v":30},"Tag 3"," Umrechnung in Stunden",null,{"$f":"Stammdaten!B26","v":1287}]
["JAHR-IST",null,{"$f":"'2023'!B8","v":0},null,{"$f":"'2023'!C8","v":0},null,{"$f":"'2023'!D8","v":0},null,{"$f":"'2023'!E8","v":0},null,{"$f":"'2023'!F8","v":0},null,{"$f":"'2023'!G8","v":0},null,{"$f":"'2023'!H8","v":0},null,{"$f":"Q4-Q45","v":30},null,{"$f":"SUM(S6:S44)","v":0},null,{"$f":"U4-W44","v":0}]
[null,"Mo",null,null,null,null,null,null,null,null,null,null,null,null,null,null,null,null,{"$f":"IF(R6=INTERN!$A$4,$R$1,\"0\")","v":"0"},null,{"$f":"SUM(C6:O6)+S6","v":0},null,null,null,null,{"$f":"IF(OR(AND(OR(C6<>\"\",E6<>\"\",G6<>\"\",I6<>\"\",K6<>\"\",M6<>\"\",O6<>\"\"),Q6<>\"\"),AND(OR(C6<>\"\",E6<>\"\",G6<>\"\",I6<>\"\",K6<>\"\",M6<>\"\",O6<>\"\"),R6<>\"\"),AND(Q6<>\"\",R6<>\"\")),\"Fehler\",\"\")","v":""}]
[null,"Die",null,null,null,null,null,null,null,null,null,null,null,null,null,null,null,null,{"$f":"IF(R7=INTERN!$A$4,$R$1,\"0\")","v":"0"},null,{"$f":"SUM(C7:O7)+S7","v":0},null,null,null,null,{"$f":"IF(OR(AND(OR(C7<>\"\",E7<>\"\",G7<>\"\",I7<>\"\",K7<>\"\",M7<>\"\",O7<>\"\"),Q7<>\"\"),AND(OR(C7<>\"\",E7<>\"\",G7<>\"\",I7<>\"\",K7<>\"\",M7<>\"\",O7<>\"\"),R7<>\"\"),AND(Q7<>\"\",R7<>\"\")),\"Fehler\",\"\")","v":""}]
[null,"Mi",null,null,null,null,null,null,null,null,null,null,null,null,null,null,null,null,{"$f":"IF(R8=INTERN!$A$4,$R$1,\"0\")","v":"0"},null,0,null,null,null,null,{"$f":"IF(OR(AND(OR(C8<>\"\",E8<>\"\",G8<>\"\",I8<>\"\",K8<>\"\",M8<>\"\",O8<>\"\"),Q8<>\"\"),AND(OR(C8<>\"\",E8<>\"\",G8<>\"\",I8<>\"\",K8<>\"\",M8<>\"\",O8<>\"\"),R8<>\"\"),AND(Q8<>\"\",R8<>\"\")),\"Fehler\",\"\")","v":""}]
[null,"Do",null,null,null,null,null,null,null,null,null,null,null,null,null,null,null,null,{"$f":"IF(R9=INTERN!$A$4,$R$1,\"0\")","v":"0"},null,0,null,null,null,null,""]
[null,"Fr",null,null,null,null,null,null,null,null,null,null,null,null,null,null,null,null,{"$f":"R10*R1","v":0},null,0,null,null,null,null,""]
[null,"Sa",null,null,null,null,null,null,null,null,null,null,null,null,null,null,null,null,null,null,{"$f":"SUM(C11:O11)","v":0},null,null,null,null,""]
["1.1.","So",null,null,null,null,null,null,null,null,null,null,null,null,null,null,null,null,null,null,{"$f":"SUM(C12:O12)","v":0},{"$f":"SUM(U6:U12)","v":0},{"$f":"Stammdaten!B26-V12","v":1287},{"$f":"(W12*100)/U1","v":100},null,""]
["2.1.","Mo",null,null,null,null,null,null,null,null,null,null,null,null,null,null,null,null,{"$f":"IF(R13=INTERN!$A$4,$R$1,\"0\")","v":"0"},null,0,null,null,null,null,""]
["3.1.","Die",null,null,null,null,null,null,null,null,null,null,null,null,null,null,null,null,{"$f":"IF(R14=INTERN!$A$4,$R$1,\"0\")","v":"0"},null,0,null,null,null,null,""]
["4.1.","Mi",null,null,null,null,null,null,null,null,null,null,null,null,null,null,null,null,{"$f":"IF(R15=INTERN!$A$4,$R$1,\"0\")","v":"0"},null,0,null,null,null,null,""]
["5.1.","Do",null,null,null,null,null,null,null,null,null,null,null,null,null,null,null,null,{"$f":"IF(R16=INTERN!$A$4,$R$1,\"0\")","v":"0"},null,0,null,null,null,null,""]
["6.1.","Fr",null,null,null,null,null,null,null,null,null,null,null,null,null,null,null,null,{"$f":"R17*R1","v":0},null,0,null,null,null,null,""]
["7.1.","Sa",null,null,null,null,null,null,null,null,null,null,null,null,null,null,null,null,null,null,{"$f":"SUM(C18:O18)","v":0},null,null,null,null,""]
["8.1.","So",null,null,null,null,null,null,null,null,null,null,null,null,null,null,null,null,null,null,{"$f":"SUM(C19:O19)","v":0},{"$f":"SUM(U13:U19)","v":0},{"$f":"W12-V19","v":1287},{"$f":"(W19*100)/U1","v":100},null,""]
["9.1.","Mo",null,null,null,null,null,null,null,null,null,null,null,null,null,null,null,null,{"$f":"IF(R20=INTERN!$A$4,$R$1,\"0\")","v":"0"},null,0," ",null,null,null,""]
["10.1.","Die",null,null,null,null,null,null,null,null,null,null,null,null,null,null,null,null,{"$f":"IF(R21=INTERN!$A$4,$R$1,\"0\")","v":"0"},null,0,null,null,null,null,""]
["11.1.","Mi",null,null,null,null,null,null,null,null,null,null,null,null,null,null,null,null,{"$f":"IF(R22=INTERN!$A$4,$R$1,\"0\")","v":"0"},null,0,null,null,null,null,""]
["12.1.","Do",null,null,null,null,null,null,null,null,null,null,null,null,null,null,null,null,{"$f":"IF(R23=INTERN!$A$4,$R$1,\"0\")","v":"0"},null,0,null,null,null,null,""]
["13.1.","Fr",null,null,null,null,null,null,null,null,null,null,null,null,null,null,null,null,{"$f":"R24*R1","v":0},null,0,null,null,null,null,""]
["14.1.","Sa",null,null,null,null,null,null,null,null,null,null,null,null,null,null,null,null,null,null,{"$f":"SUM(C25:O25)","v":0},null,null,null,null,""]
["15.1.","So",null,null,null,null,null,null,null,null,null,null,null,null,null,null,null,null,null,null,{"$f":"SUM(C26:O26)","v":0},{"$f":"SUM(U20:U26)","v":0},{"$f":"W19-V26","v":1287},{"$f":"(W26*100)/U1","v":100},null,""]
["16.1.","Mo",null,null,null,null,null,null,null,null,null,null,null,null,null,null,null,null,{"$f":"IF(R27=INTERN!$A$4,$R$1,\"0\")","v":"0"},null,0,null,null,null,null,""]
["17.1.","Die",null,null,null,null,null,null,null,null,null,null,null,null,null,null,null,null,{"$f":"IF(R28=INTERN!$A$4,$R$1,\"0\")","v":"0"},null,0,null,null,null,null,""]
["18.1.","Mi",null,null,null,null,null,null,null,null,null,null,null,null,null,null,null,null,{"$f":"IF(R29=INTERN!$A$4,$R$1,\"0\")","v":"0"},null,0,null,null,null,null,""]
["19.1.","Do",null,null,null,null,null,null,null,null,null,null,null,null,null,null,null,null,{"$f":"IF(R30=INTERN!$A$4,$R$1,\"0\")","v":"0"},null,0,null,null,null,null,""]
["20.1.","Fr",null,null,null,null,null,null,null,null,null,null,null,null,null,null,null,null,{"$f":"R31*R1","v":0},null,0,null,null,null,null,""]
["21.1.","Sa",null,null,null,null,null,null,null,null,null,null,null,null,null,null,null,null,null,null,{"$f":"SUM(C32:O32)","v":0},null,null,null,null,""]
["22.1.","So",null,null,null,null,null,null,null,null,null,null,null,null,null,null,null,null,null,null,{"$f":"SUM(C33:O33)","v":0},{"$f":"SUM(U27:U33)","v":0},{"$f":"W26-V33","v":1287},{"$f":"(W33*100)/U1","v":100},null,{"$f":"IF(OR(AND(OR(C33<>\"\",E33<>\"\",G33<>\"\",I33<>\"\",K33<>\"\",M33<>\"\",O33<>\"\"),Q33<>\"\"),AND(OR(C33<>\"\",E33<>\"\",G33<>\"\",I33<>\"\",K33<>\"\",M33<>\"\",O33<>\"\"),R33<>\"\"),AND(Q33<>\"\",R33<>\"\")),\"Fehler\",\"\")","v":""}]
["23.1.","Mo",null,null,null,null,null,null,null,null,null,null,null,null,null,null,null,null,{"$f":"IF(R34=INTERN!$A$4,$R$1,\"0\")","v":"0"},null,0,null,null,null,null,""]
["24.1.","Die",null,null,null,null,null,null,null,null,null,null,null,null,null,null,null,null,{"$f":"IF(R35=INTERN!$A$4,$R$1,\"0\")","v":"0"},null,0,null,null,null,null,""]
["25.1.","Mi",null,null,null,null,null,null,null,null,null,null,null,null,null,null,null,null,{"$f":"IF(R36=INTERN!$A$4,$R$1,\"0\")","v":"0"},null,0,null,null,null,null,""]
["26.1.","Do",null,null,null,null,null,null,null,null,null,null,null,null,null,null,null,null,{"$f":"IF(R37=INTERN!$A$4,$R$1,\"0\")","v":"0"},null,0,null,null,null,null,""]
["27.1.","Fr",null,null,null,null,null,null,null,null,null,null,null,null,null,null,null,null,{"$f":"R38*R1","v":0},null,0,null,null,null,null,""]
["28.1.","Sa",null,null,null,null,null,null,null,null,null,null,null,null,null,null,null,null,null,null,{"$f":"SUM(C39:O39)","v":0},null,null,null,null,""]
["29.1.","So",null,null,null,null,null,null,null,null,null,null,null,null,null,null,null,null,null,null,{"$f":"SUM(C40:O40)","v":0},{"$f":"SUM(U34:U40)","v":0},{"$f":"W33-V40","v":1287},{"$f":"(W40*100)/U1","v":100},null,""]
["30.1.","Mo",null,null,null,null,null,null,null,null,null,null,null,null,null,null,null,null,{"$f":"IF(R41=INTERN!$A$4,$R$1,\"0\")","v":"0"},null,0,null,null,null,null,""]
["31.1.","Di",null,null,null,null,null,null,null,null,null,null,null,null,null,null,null,null,{"$f":"IF(R42=INTERN!$A$4,$R$1,\"0\")","v":"0"},null,0,null,null,null,null,""]
[null,"Mi",null,null,null,null,null,null,null,null,null,null,null,null,null,null,null,null,{"$f":"IF(R43=INTERN!$A$4,$R$1,\"0\")","v":"0"},null,0,null,null,null,null,""]
[null,"Do",null,null,null,null,null,null,null,null,null,null,null,null,null,null,null,null,{"$f":"IF(R44=INTERN!$A$4,$R$1,\"0\")","v":"0"},null,0,{"$f":"SUM(U41:U44)","v":0},{"$f":"W40-V44","v":1287},{"$f":"(W44*100)/U1","v":100},null,""]
[null,null,"gesamt",{"$f":"SUM(C6:D44)","v":0},"gesamt",{"$f":"SUM(E6:F44)","v":0},"gesamt",{"$f":"SUM(G6:G44)","v":0},"gesamt",{"$f":"SUM(I6:J44)","v":0},"gesamt",{"$f":"SUM(K6:L44)","v":0},"gesamt",{"$f":"SUM(M6:N44)","v":0},"gesamt",{"$f":"SUM(O6:P44)","v":0},{"$f":"SUM(Q6:Q44)","v":0},null,{"$f":"SUM(S6:S44)","v":0},null,null,null,null,"AUSDRUCK-ÜBERSICHT \n(Hier klicken)"]
[]
["1 Spalte O/P: Die SpalteTagesarbeitszeit wird  im MODELL  A ausgefüllt. Dabei ist hier jeweils die Gesamtarbeitszeit pro Tag in einer Summe einzutragen. Eine  Aufteilung in einzelne Arbeitsbereiche wird nur im MODELL B vorgenommen (in Spalte C bis L). \nFür die Darstellung von MODELL A wird über der Spaltenbeschriftung im Kopf (M) auf das Minus geklickt. Überflüssige Spalten werden damit ausgeblendet. (Siehe auch Arbeitshilfe.) Für die Darstellung von MODELL B wird auf das Plus-Zeichen über Spalte O geklickt. "]
["2  Spalte Q: An Urlaubstagen ist immer die Zahl 1 (und nichts anderes) einzutragen. Zusätzlich ist darauf zu achten, dass an Urlaubstagen keine Arbeitszeit ausgefüllt wird. (Sonst würde der Widerspruch in der Tabelle dargestellt, dass an Urlaubstagen gearbeitet wird. Technisch lässt sich diese Fehldarstellung nicht ausschließen, sodass dieser Hinweis selber beachtet werden muss.) ACHTUNG: Weil an Wochendenen  keine Krankheits- und Urlaubstage eingetragen werden dürfen, sind diese Felder gesperrt. An gesetzlichen Feiertagen dürfen ebenfalls keine Urlaubstage eingetragen werden. \nMitarbeitende mit einer 6-Tage-Woche können Krankheits- und Urlaubstage jeweils freitags mit hinzuzählen. Alle anderen Wochentage sind jeweils nur für eine \"1\" freigegeben."]
["3 Spalte R/S: Je Krankheitstag oder/und personenbezogener Freistellung (Freistellung für Krankheit Kinder, Zusatzfreistellungstage z.B. für Kinder und Pflege) mit einer \"1\" angeben. Angerechnet wird zur Arbeitszeit die \"reguläre tägliche AZ im GP- oder Kirchenmusikalischen Dienst\" (Feld R1). ACHTUNG: Weil an Wochendenen  keine Krankheits- und Urlaubstagstage eingetragen werden dürfen, sind diese Felder gesperrt. An gesetzlichen Feiertagen dürfen ebenfalls keine Krankheitstage eingetragen werden. \nMitarbeitende mit einer 6-Tage-Woche können Krankheitstage jeweils freitags mit hinzuzählen (statt eine 1 eine 2 eintragen). Alle anderen Wochentage sind jeweils nur für eine \"1\" freigegeben."]
["4 Spalte T: Hier werden die Arbeitsorte des jeweiligen Tages eingetragen. Wegen der  begrenzten Spaltengröße empfiehlt es sich, eigene Kürzel festzulegen."]
["5 Spalte U, Zeile 4 und 5: JAHR-SOLL entspricht der Jahresplanung; JAHR-IST enthält die tagesaktuelle, schon geleistete AZ in diesem Bereich. "]
["6 Spalte Y: Platz für Anmerkungen.  ACHTUNG: Die Schrift passt sich der Größe des Feldes an. Bei viel Text wird die Schrift sehr klein. Im Bedarfsfall kann im Eingabefeld der Text angeschaut werden. Diese Form ist notwendig, um einen Ausdruck zu ermöglichen."]

{"sheet":"Februar","index":5,"n_rows":52,"n_cols":26,"rows_kept":52,"cut":false,"hidden":false,"merged":[[0,21,0,25],[1,21,1,25],[10,16,11,18],[17,16,18,18],[24,16,25,18],[31,16,32,18],[5,21,10,21],[5,22,10,22],[5,23,10,23],[2,17,2,18],[26,23,31,23],[38,16,39,18],[0,0,0,11],[0,14,0,16],[0,17,0,18],[3,0,3,1],[3,2,3,3],[1,0,1,13],[2,2,2,3],[2,4,2,5],[2,6,2,7],[4,0,4,1],[4,2,4,3],[4,4,4,5],[4,6,4,7],[4,8,4,9],[4,10,4,11],[2,8,2,9],[2,10,2,11],[2,12,2,13],[4,12,4,13],[4,14,4,15],[5,2,5,3],[5,4,5,5],[5,6,5,7],[5,8,5,9],[5,10,5,11],[5,12,5,13],[5,14,5,15],[3,4,3,5],[3,6,3,7],[3,8,3,9],[3,10,3,11],[3,12,3,13],[3,14,3,15],[7,14,7,15],[8,14,8,15],[8,2,8,3],[8,4,8,5],[8,6,8,7],[8,8,8,9],[8,10,8,11],[8,12,8,13],[6,14,6,15],[7,2,7,3],[7,4,7,5],[7,6,7,7],[7,8,7,9],[7,10,7,11],[7,12,7,13],[6,2,6,3],[6,4,6,5],[6,6,6,7],[6,8,6,9],[6,10,6,11],[6,12,6,13],[11,2,11,3],[11,4,11,5],[11,6,11,7],[11,8,11,9],[11,10,11,11],[11,12,11,13],[9,4,9,5],[11,14,11,15],[9,14,9,15],[10,2,10,3],[10,4,10,5],[10,6,10,7],[10,8,10,9],[10,10,10,11],[10,12,10,13],[10,14,10,15],[9,2,9,3],[9,6,9,7],[9,8,9,9],[9,10,9,11],[9,12,9,13],[12,14,12,15],[12,21,17,21],[12,6,12,7],[12,8,12,9],[12,10,12,11],[12,12,12,13],[12,22,17,22],[12,23,17,23],[13,2,13,3],[13,4,13,5],[13,6,13,7],[13,8,13,9],[13,10,13,11],[13,12,13,13],[12,2,12,3],[12,4,12,5],[13,14,13,15],[14,14,14,15],[15,14,15,15],[14,2,14,3],[14,4,14,5],[14,6,14,7],[14,8,14,9],[14,10,14,11],[14,12,14,13],[15,2,15,3],[18,14,18,15],[17,2,17,3],[17,4,17,5],[17,6,17,7],[17,8,17,9],[17,10,17,11],[17,12,17,13],[18,2,18,3],[18,4,18,5],[16,14,16,15],[17,14,17,15],[16,2,16,3],[16,4,16,5],[16,6,16,7],[16,8,16,9],[16,10,16,11],[16,12,16,13],[15,4,15,5],[15,6,15,7],[15,8,15,9],[15,10,15,11],[15,12,15,13],[18,6,18,7],[18,8,18,9],[18,10,18,11],[18,12,18,13],[19,2,19,3],[19,4,19,5],[19,6,19,7],[19,8,19,9],[19,10,19,11],[19,12,19,13],[19,14,19,15],[19,21,24,21],[19,22,24,22],[19,23,24,23],[20,2,20,3],[20,4,20,5],[20,6,20,7],[20,8,20,9],[20,10,20,11],[20,12,20,13],[20,14,20,15],[21,14,21,15],[22,14,22,15],[21,2,21,3],[21,4,21,5],[21,6,21,7],[21,8,21,9],[21,10,21,11],[21,12,21,13],[22,2,22,3],[23,14,23,15],[23,2,23,3],[23,4,23,5],[23,6,23,7],[25,14,25,15],[24,2,24,3],[24,4,24,5],[24,6,24,7],[24,8,24,9],[24,10,24,11],[24,12,24,13],[25,2,25,3],[25,4,25,5],[24,14,24,15],[23,8,23,9],[23,10,23,11],[23,12,23,13],[22,4,22,5],[22,6,22,7],[22,8,22,9],[22,10,22,11],[22,12,22,13],[25,6,25,7],[25,8,25,9],[25,10,25,11],[25,12,25,13],[26,2,26,3],[26,4,26,5],[26,6,26,7],[26,8,26,9],[26,10,26,11],[26,12,26,13],[26,14,26,15],[26,21,31,21],[26,22,31,22],[27,2,27,3],[27,4,27,5],[27,6,27,7],[27,8,27,9],[27,10,27,11],[27,12,27,13],[27,14,27,15],[28,14,28,15],[29,14,29,15],[28,2,28,3],[28,4,28,5],[28,6,28,7],[28,8,28,9],[28,10,28,11],[28,12,28,13],[29,2,29,3],[32,14,32,15],[31,2,31,3],[31,4,31,5],[31,6,31,7],[31,8,31,9],[31,10,31,11],[31,12,31,13],[32,2,32,3],[32,4,32,5],[30,14,30,15],[31,14,31,15],[30,2,30,3],[30,4,30,5],[30,6,30,7],[30,8,30,9],[30,10,30,11],[30,12,30,13],[29,4,29,5],[29,6,29,7],[29,8,29,9],[29,10,29,11],[29,12,29,13],[32,6,32,7],[32,8,32,9],[32,10,32,11],[32,12,32,13],[33,2,33,3],[33,4,33,5],[33,6,33,7],[33,8,33,9],[33,10,33,11],[33,12,33,13],[33,14,33,15],[33,21,38,21],[33,22,38,22],[33,23,38,23],[34,2,34,3],[34,4,34,5],[34,6,34,7],[34,8,34,9],[34,10,34,11],[34,12,34,13],[34,14,34,15],[35,14,35,15],[36,14,36,15],[35,2,35,3],[35,4,35,5],[35,6,35,7],[35,8,35,9],[35,10,35,11],[35,12,35,13],[36,2,36,3],[37,14,37,15],[37,2,37,3],[37,4,37,5],[37,6,37,7],[39,14,39,15],[38,2,38,3],[38,4,38,5],[38,6,38,7],[38,8,38,9],[38,10,38,11],[38,12,38,13],[39,2,39,3],[39,4,39,5],[38,14,38,15],[37,8,37,9],[37,10,37,11],[37,12,37,13],[36,4,36,5],[36,6,36,7],[36,8,36,9],[36,10,36,11],[36,12,36,13],[39,6,39,7],[39,8,39,9],[39,10,39,11],[39,12,39,13],[40,2,40,3],[40,4,40,5],[40,6,40,7],[40,8,40,9],[40,10,40,11],[40,12,40,13],[40,21,42,21],[40,22,42,22],[40,23,42,23],[41,2,41,3],[41,4,41,5],[41,6,41,7],[41,8,41,9],[41,10,41,11],[41,12,41,13],[41,14,41,15],[42,14,42,15],[42,2,42,3],[42,4,42,5],[42,6,42,7],[42,8,42,9],[42,10,42,11],[42,12,42,13],[40,14,40,15],[44,19,45,22],[44,23,45,24],[50,0,50,24],[51,0,51,24],[43,14,43,15],[46,0,46,24],[47,0,47,24],[48,0,48,24],[49,0,49,24],[43,2,43,3],[43,4,43,5],[43,6,43,7],[43,8,43,9],[43,10,43,11],[43,12,43,13]]}
[{"$f":"Stammdaten!B3","v":0},null,null,null,null,null,null,null,null,null,null,null,null,null,{"$f":"Januar!O1","v":"reguläre tägliche AZ im GP-Dienst/ Kirchenmusik (Stunden)"},null,null,{"$f":"Stammdaten!B31","v":5.85},null,{"$f":"Januar!T1","v":"SOLL-AZ  im GP/KM-Dienst (Stunden)"},{"$f":"Stammdaten!B26","v":1287},"FEBRUAR"]
[null,null,null,null,null,null,null,null,null,null,null,null,null,null,"a)  Angaben in Stunden (Bsp. 1,00=60min; 1,5=90min; 0,75=45min; 0,25=15min)",null,null,null,null,null,null,{"$f":"Januar!V2","v":"b)  Die Felder in dieser Farbe werden automatisch ausgefüllt."}]
[null,"Tag",{"$f":"'2023'!B6","v":"1) Regelmäßige Veranstaltungen "},null,{"$f":"'2023'!C6","v":"2) Einzelveranstaltungen, Projekte, Freizeiten, besondere Dienste "},null,{"$f":"'2023'!D6","v":"3) Gremien, Konvente"},null,{"$f":"'2023'!E6","v":"4) Sonstige Dienstpflichten "},null,{"$f":"'2023'!F6","v":"5) Entwicklung neuer Arbeitsansätze / Unvorhersehbares / seelsorgerische Begleitung Einzelner"},null,{"$f":"'2023'!G6","v":"6) sonstige Arbeitsfelder (z.B. Kirchenmusik) "},null,{"$f":"'2023'!H6","v":"Tagesarbeitszeit"},"siehe 1","Urlaub - Tag je als 1 eintragen  2","Krankheit und weitere personenbezogene  Freistellungen - Tag je als \"1\" eintragen 3",null,"Ort 4","geleistete AZ 5","geleistete Wochenstunden","Restarbeitszeit Jahr","verbleibende AZ im Jahr in Prozent","Anmerkung / Hinweis / Begründung 6",{"$f":"Januar!Z3","v":"Plausibilitätsprüfung "}]
["JAHR-SOLL",null,{"$f":"Stammdaten!B34","v":0},null,{"$f":"Stammdaten!B35","v":0},null,{"$f":"Stammdaten!B36","v":0},null,{"$f":"Stammdaten!B37","v":0},null,{"$f":"Stammdaten!B38","v":0},null,{"$f":"Stammdaten!B39","v":0},null,{"$f":"Stammdaten!B26","v":1287},null,{"$f":"Stammdaten!B7","v":30},"Tag 3"," Umrechnung in Stunden",null,{"$f":"Stammdaten!B26","v":1287}]
["JAHR-IST",null,{"$f":"'2023'!B8","v":0},null,{"$f":"'2023'!C8","v":0},null,{"$f":"'2023'!D8","v":0},null,{"$f":"'2023'!E8","v":0},null,{"$f":"'2023'!F8","v":0},null,{"$f":"'2023'!G8","v":0},null,{"$f":"'2023'!H8","v":0},null,{"$f":"Januar!Q5-Q45","v":30},null,{"$f":"SUM(S6:S44)","v":0},null,{"$f":"U4-W44","v":0}]
[null,"Mo",null,null,null,null,null,null,null,null,null,null,null,null,null,null,null,null,{"$f":"IF(R6=INTERN!$A$4,$R$1,\"0\")","v":"0"},null,{"$f":"SUM(C6:O6)+S6","v":0},null,null,null,null,{"$f":"IF(OR(AND(OR(C6<>\"\",E6<>\"\",G6<>\"\",I6<>\"\",K6<>\"\",M6<>\"\",O6<>\"\"),Q6<>\"\"),AND(OR(C6<>\"\",E6<>\"\",G6<>\"\",I6<>\"\",K6<>\"\",M6<>\"\",O6<>\"\"),R6<>\"\"),AND(Q6<>\"\",R6<>\"\")),\"Fehler\",\"\")","v":""}]
[null,"Die",null,null,null,null,null,null,null,null,null,null,null,null,null,null,null,null,{"$f":"IF(R7=INTERN!$A$4,$R$1,\"0\")","v":"0"},null,{"$f":"SUM(C7:O7)+S7","v":0},null,null,null,null,{"$f":"IF(OR(AND(OR(C7<>\"\",E7<>\"\",G7<>\"\",I7<>\"\",K7<>\"\",M7<>\"\",O7<>\"\"),Q7<>\"\"),AND(OR(C7<>\"\",E7<>\"\",G7<>\"\",I7<>\"\",K7<>\"\",M7<>\"\",O7<>\"\"),R7<>\"\"),AND(Q7<>\"\",R7<>\"\")),\"Fehler\",\"\")","v":""}]
["1.2.","Mi",null,null,null,null,null,null,null,null,null,null,null,null,null,null,null,null,{"$f":"IF(R8=INTERN!$A$4,$R$1,\"0\")","v":"0"},null,0,null,null,null,null,""]
["2.2.","Do",null,null,null,null,null,null,null,null,null,null,null,null,null,null,null,null,{"$f":"IF(R9=INTERN!$A$4,$R$1,\"0\")","v":"0"},null,0,null,null,null,null,""]
["3.2.","Fr",null,null,null,null,null,null,null,null,null,null,null,null,null,null,null,null,{"$f":"R10*R1","v":0},null,0,null,null,null,null,""]
["4.2.","Sa",null,null,null,null,null,null,null,null,null,null,null,null,null,null,null,null,null,null,{"$f":"SUM(C11:O11)","v":0},null,null,null,null,""]
["5.2.","So",null,null,null,null,null,null,null,null,null,null,null,null,null,null,null,null,null,null,{"$f":"SUM(C12:O12)","v":0},{"$f":"SUM(U6:U12)","v":0},{"$f":"Januar!W44-Februar!V12","v":1287},{"$f":"(W12*100)/U1","v":100},null,""]
["6.2.","Mo",null,null,null,null,null,null,null,null,null,null,null,null,null,null,null,null,{"$f":"IF(R13=INTERN!$A$4,$R$1,\"0\")","v":"0"},null,{"$f":"SUM(C13:O13)+S13","v":0},null,null,null,null,""]
["7.2.","Die",null,null,null,null,null,null,null,null,null,null,null,null,null,null,null,null,{"$f":"IF(R14=INTERN!$A$4,$R$1,\"0\")","v":"0"},null,0,null,null,null,null,""]
["8.2.","Mi",null,null,null,null,null,null,null,null,null,null,null,null,null,null,null,null,{"$f":"IF(R15=INTERN!$A$4,$R$1,\"0\")","v":"0"},null,0,null,null,null,null,""]
["9.2.","Do",null,null,null,null,null,null,null,null,null,null,null,null,null,null,null,null,{"$f":"IF(R16=INTERN!$A$4,$R$1,\"0\")","v":"0"},null,0,null,null,null,null,""]
["10.2.","Fr",null,null,null,null,null,null,null,null,null,null,null,null,null,null,null,null,{"$f":"R17*R1","v":0},null,0,null,null,null,null,""]
["11.2.","Sa",null,null,null,null,null,null,null,null,null,null,null,null,null,null,null,null,null,null,{"$f":"SUM(C18:O18)","v":0},null,null,null,null,""]
["12.2.","So",null,null,null,null,null,null,null,null,null,null,null,null,null,null,null,null,null,null,{"$f":"SUM(C19:O19)","v":0},{"$f":"SUM(U13:U19)","v":0},{"$f":"W12-V19","v":1287},{"$f":"(W19*100)/U1","v":100},null,""]
["13.2.","Mo",null,null,null,null,null,null,null,null,null,null,null,null,null,null,null,null,{"$f":"IF(R20=INTERN!$A$4,$R$1,\"0\")","v":"0"},null,0," ",null,null,null,""]
["14.2.","Die",null,null,null,null,null,null,null,null,null,null,null,null,null,null,null,null,{"$f":"IF(R21=INTERN!$A$4,$R$1,\"0\")","v":"0"},null,0,null,null,null,null,""]
["15.2.","Mi",null,null,null,null,null,null,null,null,null,null,null,null,null,null,null,null,{"$f":"IF(R22=INTERN!$A$4,$R$1,\"0\")","v":"0"},null,0,null,null,null,null,""]
["16.2.","Do",null,null,null,null,null,null,null,null,null,null,null,null,null,null,null,null,{"$f":"IF(R23=INTERN!$A$4,$R$1,\"0\")","v":"0"},null,0,null,null,null,null,""]
["17.2.","Fr",null,null,null,null,null,null,null,null,null,null,null,null,null,null,null,null,{"$f":"R24*R1","v":0},null,0,null,null,null,null,""]
["18.2.","Sa",null,null,null,null,null,null,null,null,null,null,null,null,null,null,null,null,null,null,{"$f":"SUM(C25:O25)","v":0},null,null,null,null,""]
["19.2.","So",null,null,null,null,null,null,null,null,null,null,null,null,null,null,null,null,null,null,{"$f":"SUM(C26:O26)","v":0},{"$f":"SUM(U20:U26)","v":0},{"$f":"W19-V26","v":1287},{"$f":"(W26*100)/U1","v":100},null,""]
["20.2.","Mo",null,null,null,null,null,null,null,null,null,null,null,null,null,null,null,null,{"$f":"IF(R27=INTERN!$A$4,$R$1,\"0\")","v":"0"},null,0,null,null,null,null,""]
["21.2.","Die",null,null,null,null,null,null,null,null,null,null,null,null,null,null,null,null,{"$f":"IF(R28=INTERN!$A$4,$R$1,\"0\")","v":"0"},null,0,null,null,null,null,""]
["22.2.","Mi",null,null,null,null,null,null,null,null,null,null,null,null,null,null,null,null,{"$f":"IF(R29=INTERN!$A$4,$R$1,\"0\")","v":"0"},null,0,null,null,null,null,""]
["23.2.","Do",null,null,null,null,null,null,null,null,null,null,null,null,null,null,null,null,{"$f":"IF(R30=INTERN!$A$4,$R$1,\"0\")","v":"0"},null,0,null,null,null,null,""]
["24.2.","Fr",null,null,null,null,null,null,null,null,null,null,null,null,null,null,null,null,{"$f":"R31*R1","v":0},null,0,null,null,null,null,""]
["25.2.","Sa",null,null,null,null,null,null,null,null,null,null,null,null,null,null,null,null,null,null,{"$f":"SUM(C32:O32)","v":0},null,null,null,null,""]
["26.2.","So",null,null,null,null,null,null,null,null,null,null,null,null,null,null,null,null,null,null,{"$f":"SUM(C33:O33)","v":0},{"$f":"SUM(U27:U33)","v":0},{"$f":"W26-V33","v":1287},{"$f":"(W33*100)/U1","v":100},null,{"$f":"IF(OR(AND(OR(C33<>\"\",E33<>\"\",G33<>\"\",I33<>\"\",K33<>\"\",M33<>\"\",O33<>\"\"),Q33<>\"\"),AND(OR(C33<>\"\",E33<>\"\",G33<>\"\",I33<>\"\",K33<>\"\",M33<>\"\",O33<>\"\"),R33<>\"\"),AND(Q33<>\"\",R33<>\"\")),\"Fehler\",\"\")","v":""}]
["27.2.","Mo",null,null,null,null,null,null,null,null,null,null,null,null,null,null,null,null,{"$f":"IF(R34=INTERN!$A$4,$R$1,\"0\")","v":"0"},null,0,null,null,null,null,""]
["28.2.","Die",null,null,null,null,null,null,null,null,null,null,null,null,null,null,null,null,{"$f":"IF(R35=INTERN!$A$4,$R$1,\"0\")","v":"0"},null,0,null,null,null,null,""]
[null,"Mi",null,null,null,null,null,null,null,null,null,null,null,null,null,null,null,null,{"$f":"IF(R36=INTERN!$A$4,$R$1,\"0\")","v":"0"},null,0,null,null,null,null,""]
[null,"Do",null,null,null,null,null,null,null,null,null,null,null,null,null,null,null,null,{"$f":"IF(R37=INTERN!$A$4,$R$1,\"0\")","v":"0"},null,0,null,null,null,null,""]
[null,"Fr",null,null,null,null,null,null,null,null,null,null,null,null,null,null,null,null,{"$f":"R38*R1","v":0},null,0,null,null,null,null,""]
[null,"Sa",null,null,null,null,null,null,null,null,null,null,null,null,null,null,null,null,null,null,{"$f":"SUM(C39:O39)","v":0},null,null,null,null,""]
[null,"So",null,null,null,null,null,null,null,null,null,null,null,null,null,null,null,null,null,null,{"$f":"SUM(C40:O40)","v":0},{"$f":"SUM(U34:U40)","v":0},{"$f":"W33-V40","v":1287},{"$f":"(W40*100)/U1","v":100},null,""]
[null,"Mo",null,null,null,null,null,null,null,null,null,null,null,null,null,null,null,null,{"$f":"IF(R41=INTERN!$A$4,$R$1,\"0\")","v":"0"},null,0,null,null,null,null,""]
[null,"Di",null,null,null,null,null,null,null,null,null,null,null,null,null,null,null,null,{"$f":"IF(R42=INTERN!$A$4,$R$1,\"0\")","v":"0"},null,0,null,null,null,null,""]
[null,"Mi",null,null,null,null,null,null,null,null,null,null,null,null,null,null,null,null,{"$f":"IF(R43=INTERN!$A$4,$R$1,\"0\")","v":"0"},null,0,null,null,null,null,""]
[null,"Do",null,null,null,null,null,null,null,null,null,null,null,null,null,null,null,null,{"$f":"IF(R44=INTERN!$A$4,$R$1,\"0\")","v":"0"},null,0,{"$f":"SUM(U41:U44)","v":0},{"$f":"W40-V44","v":1287},{"$f":"(W44*100)/U1","v":100},null,""]
[null,null,"gesamt",{"$f":"SUM(C6:D44)","v":0},"gesamt",{"$f":"SUM(E6:F44)","v":0},"gesamt",{"$f":"SUM(G6:G44)","v":0},"gesamt",{"$f":"SUM(I6:J44)","v":0},"gesamt",{"$f":"SUM(K6:L44)","v":0},"gesamt",{"$f":"SUM(M6:N44)","v":0},"gesamt",{"$f":"SUM(O6:P44)","v":0},{"$f":"SUM(Q6:Q44)","v":0},null,{"$f":"SUM(S6:S44)","v":0},null,null,null,null,"AUSDRUCK-ÜBERSICHT \n(Hier klicken)"]
[]
["1 Spalte O/P: Die SpalteTagesarbeitszeit wird  im MODELL  A ausgefüllt. Dabei ist hier jeweils die Gesamtarbeitszeit pro Tag in einer Summe einzutragen. Eine  Aufteilung in einzelne Arbeitsbereiche wird nur im MODELL B vorgenommen (in Spalte C bis L). \nFür die Darstellung von MODELL A wird über der Spaltenbeschriftung im Kopf (M) auf das Minus geklickt. Überflüssige Spalten werden damit ausgeblendet. (Siehe auch Arbeitshilfe.) Für die Darstellung von MODELL B wird auf das Plus-Zeichen über Spalte O geklickt. "]
["2  Spalte Q: An Urlaubstagen ist immer die Zahl 1 (und nichts anderes) einzutragen. Zusätzlich ist darauf zu achten, dass an Urlaubstagen keine Arbeitszeit ausgefüllt wird. (Sonst würde der Widerspruch in der Tabelle dargestellt, dass an Urlaubstagen gearbeitet wird. Technisch lässt sich diese Fehldarstellung nicht ausschließen, sodass dieser Hinweis selber beachtet werden muss.) ACHTUNG: Weil an Wochendenen  keine Krankheits- und Urlaubstage eingetragen werden dürfen, sind diese Felder gesperrt. An gesetzlichen Feiertagen dürfen ebenfalls keine Urlaubstage eingetragen werden. \nMitarbeitende mit einer 6-Tage-Woche können Krankheits- und Urlaubstage jeweils freitags mit hinzuzählen. Alle anderen Wochentage sind jeweils nur für eine \"1\" freigegeben."]
["3 Spalte R/S: Je Krankheitstag oder/und personenbezogener Freistellung (Freistellung für Krankheit Kinder, Zusatzfreistellungstage z.B. für Kinder und Pflege) mit einer \"1\" angeben. Angerechnet wird zur Arbeitszeit die \"reguläre tägliche AZ im GP- oder Kirchenmusikalischen Dienst\" (Feld R1). ACHTUNG: Weil an Wochendenen  keine Krankheits- und Urlaubstagstage eingetragen werden dürfen, sind diese Felder gesperrt. An gesetzlichen Feiertagen dürfen ebenfalls keine Krankheitstage eingetragen werden. \nMitarbeitende mit einer 6-Tage-Woche können Krankheitstage jeweils freitags mit hinzuzählen (statt eine 1 eine 2 eintragen). Alle anderen Wochentage sind jeweils nur für eine \"1\" freigegeben."]
["4 Spalte T: Hier werden die Arbeitsorte des jeweiligen Tages eingetragen. Wegen der  begrenzten Spaltengröße empfiehlt es sich, eigene Kürzel festzulegen."]
["5 Spalte U, Zeile 4 und 5: JAHR-SOLL entspricht der Jahresplanung; JAHR-IST enthält die tagesaktuelle, schon geleistete AZ in diesem Bereich. "]
["6 Spalte Y: Platz für Anmerkungen.  ACHTUNG: Die Schrift passt sich der Größe des Feldes an. Bei viel Text wird die Schrift sehr klein. Im Bedarfsfall kann im Eingabefeld der Text angeschaut werden. Diese Form ist notwendig, um einen Ausdruck zu ermöglichen."]

{"sheet":"März","index":6,"n_rows":52,"n_cols":26,"rows_kept":52,"cut":false,"hidden":false,"merged":[[0,21,0,25],[1,21,1,25],[10,16,11,18],[17,16,18,18],[24,16,25,18],[31,16,32,18],[26,23,31,23],[19,23,24,23],[12,23,17,23],[2,17,2,18],[26,21,31,21],[26,22,31,22],[12,21,17,21],[12,22,17,22],[5,23,10,23],[5,21,10,21],[5,22,10,22],[38,16,39,18],[50,0,50,24],[43,8,43,9],[43,10,43,11],[43,12,43,13],[41,14,41,15],[40,14,40,15],[40,21,42,21],[40,22,42,22],[40,23,42,23],[41,8,41,9],[41,10,41,11],[41,12,41,13],[42,10,42,11],[42,12,42,13],[42,14,42,15],[42,8,42,9],[41,2,41,3],[41,4,41,5],[41,6,41,7],[42,2,42,3],[42,4,42,5],[42,6,42,7],[39,14,39,15],[51,0,51,24],[43,14,43,15],[46,0,46,24],[47,0,47,24],[48,0,48,24],[49,0,49,24],[43,2,43,3],[43,4,43,5],[43,6,43,7],[44,19,45,22],[44,23,45,24],[33,10,33,11],[33,12,33,13],[33,14,33,15],[38,2,38,3],[38,4,38,5],[40,2,40,3],[40,4,40,5],[40,6,40,7],[40,8,40,9],[40,10,40,11],[40,12,40,13],[39,2,39,3],[39,4,39,5],[39,6,39,7],[39,8,39,9],[39,10,39,11],[39,12,39,13],[38,6,38,7],[38,8,38,9],[38,10,38,11],[38,12,38,13],[37,4,37,5],[37,6,37,7],[37,8,37,9],[36,2,36,3],[37,14,37,15],[38,14,38,15],[36,10,36,11],[35,2,35,3],[35,4,35,5],[35,6,35,7],[36,8,36,9],[35,8,35,9],[36,4,36,5],[36,6,36,7],[33,22,38,22],[33,23,38,23],[34,14,34,15],[35,14,35,15],[37,10,37,11],[37,12,37,13],[36,14,36,15],[32,12,32,13],[34,2,34,3],[34,4,34,5],[34,6,34,7],[34,8,34,9],[34,10,34,11],[34,12,34,13],[33,4,33,5],[33,6,33,7],[33,8,33,9],[32,14,32,15],[33,21,38,21],[36,12,36,13],[35,10,35,11],[35,12,35,13],[33,2,33,3],[37,2,37,3],[32,2,32,3],[32,4,32,5],[32,6,32,7],[32,8,32,9],[32,10,32,11],[28,2,28,3],[30,4,30,5],[30,6,30,7],[29,2,29,3],[31,2,31,3],[31,4,31,5],[30,8,30,9],[30,12,30,13],[27,14,27,15],[28,14,28,15],[30,2,30,3],[29,4,29,5],[29,6,29,7],[29,14,29,15],[30,14,30,15],[27,2,27,3],[27,4,27,5],[28,4,28,5],[28,12,28,13],[24,6,24,7],[24,8,24,9],[24,10,24,11],[24,12,24,13],[21,6,21,7],[21,12,21,13],[31,14,31,15],[29,8,29,9],[29,10,29,11],[29,12,29,13],[26,6,26,7],[26,8,26,9],[26,10,26,11],[26,12,26,13],[31,6,31,7],[31,8,31,9],[31,10,31,11],[31,12,31,13],[28,6,28,7],[26,14,26,15],[30,10,30,11],[27,6,27,7],[27,8,27,9],[27,10,27,11],[25,2,25,3],[25,4,25,5],[25,6,25,7],[25,8,25,9],[25,10,25,11],[25,12,25,13],[26,2,26,3],[26,4,26,5],[28,8,28,9],[28,10,28,11],[27,12,27,13],[25,14,25,15],[24,2,24,3],[24,4,24,5],[19,21,24,21],[19,22,24,22],[20,12,20,13],[23,12,23,13],[20,14,20,15],[21,14,21,15],[23,2,23,3],[23,4,23,5],[23,6,23,7],[22,2,22,3],[22,4,22,5],[22,6,22,7],[22,14,22,15],[23,14,23,15],[24,14,24,15],[22,8,22,9],[22,10,22,11],[22,12,22,13],[19,8,19,9],[19,10,19,11],[19,12,19,13],[19,14,19,15],[23,10,23,11],[20,2,20,3],[20,4,20,5],[20,6,20,7],[20,8,20,9],[20,10,20,11],[21,8,21,9],[21,10,21,11],[23,8,23,9],[21,4,21,5],[21,2,21,3],[18,2,18,3],[18,4,18,5],[18,6,18,7],[18,8,18,9],[18,10,18,11],[18,12,18,13],[19,2,19,3],[19,4,19,5],[19,6,19,7],[13,12,13,13],[16,12,16,13],[13,14,13,15],[14,14,14,15],[15,4,15,5],[15,6,15,7],[18,14,18,15],[17,2,17,3],[17,4,17,5],[14,12,14,13],[17,6,17,7],[17,8,17,9],[17,10,17,11],[17,12,17,13],[15,14,15,15],[16,14,16,15],[17,14,17,15],[15,8,15,9],[15,10,15,11],[15,12,15,13],[16,10,16,11],[16,8,16,9],[13,2,13,3],[13,4,13,5],[13,6,13,7],[13,8,13,9],[13,10,13,11],[14,8,14,9],[14,10,14,11],[14,2,14,3],[16,2,16,3],[15,2,15,3],[12,2,12,3],[12,4,12,5],[12,6,12,7],[12,8,12,9],[14,4,14,5],[14,6,14,7],[16,4,16,5],[16,6,16,7],[12,10,12,11],[12,12,12,13],[12,14,12,15],[11,2,11,3],[11,4,11,5],[11,6,11,7],[11,8,11,9],[11,10,11,11],[11,12,11,13],[11,14,11,15],[10,12,10,13],[8,8,8,9],[8,10,8,11],[8,14,8,15],[9,14,9,15],[10,6,10,7],[10,8,10,9],[10,10,10,11],[9,10,9,11],[9,12,9,13],[10,14,10,15],[9,6,9,7],[9,8,9,9],[6,12,6,13],[6,14,6,15],[9,2,9,3],[9,4,9,5],[7,14,7,15],[8,2,8,3],[8,4,8,5],[8,6,8,7],[7,10,7,11],[7,12,7,13],[8,12,8,13],[10,2,10,3],[10,4,10,5],[5,12,5,13],[3,0,3,1],[3,2,3,3],[7,6,7,7],[7,8,7,9],[4,12,4,13],[5,4,5,5],[5,6,5,7],[5,8,5,9],[7,2,7,3],[7,4,7,5],[5,10,5,11],[3,4,3,5],[3,6,3,7],[3,8,3,9],[3,10,3,11],[3,12,3,13],[6,2,6,3],[6,4,6,5],[6,6,6,7],[6,8,6,9],[6,10,6,11],[0,0,0,11],[0,14,0,16],[0,17,0,18],[1,0,1,13],[2,4,2,5],[2,6,2,7],[2,8,2,9],[2,10,2,11],[2,12,2,13],[2,2,2,3],[3,14,3,15],[5,14,5,15],[4,0,4,1],[4,2,4,3],[4,4,4,5],[4,6,4,7],[4,8,4,9],[4,10,4,11],[4,14,4,15],[5,2,5,3]]}
[{"$f":"Stammdaten!B3","v":0},null,null,null,null,null,null,null,null,null,null,null,null,null,{"$f":"Februar!O1","v":"reguläre tägliche AZ im GP-Dienst/ Kirchenmusik (Stunden)"},null,null,{"$f":"Stammdaten!B31","v":5.85},null,{"$f":"Januar!T1","v":"SOLL-AZ  im GP/KM-Dienst (Stunden)"},{"$f":"Stammdaten!B26","v":1287},"MÄRZ"]
[null,null,null,null,null,null,null,null,null,null,null,null,null,null,"a)  Angaben in Stunden (Bsp. 1,00=60min; 1,5=90min; 0,75=45min; 0,25=15min)",null,null,null,null,null,null,{"$f":"Januar!V2","v":"b)  Die Felder in dieser Farbe werden automatisch ausgefüllt."}]
[null,"Tag",{"$f":"'2023'!B6","v":"1) Regelmäßige Veranstaltungen "},null,{"$f":"'2023'!C6","v":"2) Einzelveranstaltungen, Projekte, Freizeiten, besondere Dienste "},null,{"$f":"'2023'!D6","v":"3) Gremien, Konvente"},null,{"$f":"'2023'!E6","v":"4) Sonstige Dienstpflichten "},null,{"$f":"'2023'!F6","v":"5) Entwicklung neuer Arbeitsansätze / Unvorhersehbares / seelsorgerische Begleitung Einzelner"},null,{"$f":"'2023'!G6","v":"6) sonstige Arbeitsfelder (z.B. Kirchenmusik) "},null,{"$f":"'2023'!H6","v":"Tagesarbeitszeit"},"siehe 1","Urlaub - Tag je als 1 eintragen  2","Krankheit und weitere personenbezogene  Freistellungen - Tag je als \"1\" eintragen 3",null,"Ort 4","geleistete AZ 5","geleistete Wochenstunden","Restarbeitszeit Jahr","verbleibende AZ im Jahr in Prozent","Anmerkung / Hinweis / Begründung 6",{"$f":"Januar!Z3","v":"Plausibilitätsprüfung "}]
["JAHR-SOLL",null,{"$f":"Stammdaten!B34","v":0},null,{"$f":"Stammdaten!B35","v":0},null,{"$f":"Stammdaten!B36","v":0},null,{"$f":"Stammdaten!B37","v":0},null,{"$f":"Stammdaten!B38","v":0},null,{"$f":"Stammdaten!B39","v":0},null,{"$f":"Stammdaten!B26","v":1287},null,{"$f":"Stammdaten!B7","v":30},"Tag 3"," Umrechnung in Stunden",null,{"$f":"Stammdaten!B26","v":1287}]
["JAHR-IST",null,{"$f":"'2023'!B8","v":0},null,{"$f":"'2023'!C8","v":0},null,{"$f":"'2023'!D8","v":0},null,{"$f":"'2023'!E8","v":0},null,{"$f":"'2023'!F8","v":0},null,{"$f":"'2023'!G8","v":0},null,{"$f":"'2023'!H8","v":0},null,{"$f":"Februar!Q5-März!Q45","v":30},null,{"$f":"SUM(S6:S44)","v":0},null,{"$f":"U4-W44","v":0}]
[null,"Mo",null,null,null,null,null,null,null,null,null,null,null,null,null,null,null,null,{"$f":"IF(R6=INTERN!$A$4,$R$1,\"0\")","v":"0"},null,{"$f":"SUM(C6:O6)+S6","v":0},null,null,null,null,{"$f":"IF(OR(AND(OR(C6<>\"\",E6<>\"\",G6<>\"\",I6<>\"\",K6<>\"\",M6<>\"\",O6<>\"\"),Q6<>\"\"),AND(OR(C6<>\"\",E6<>\"\",G6<>\"\",I6<>\"\",K6<>\"\",M6<>\"\",O6<>\"\"),R6<>\"\"),AND(Q6<>\"\",R6<>\"\")),\"Fehler\",\"\")","v":""}]
[null,"Die",null,null,null,null,null,null,null,null,null,null,null,null,null,null,null,null,{"$f":"IF(R7=INTERN!$A$4,$R$1,\"0\")","v":"0"},null,{"$f":"SUM(C7:O7)+S7","v":0},null,null,null,null,{"$f":"IF(OR(AND(OR(C7<>\"\",E7<>\"\",G7<>\"\",I7<>\"\",K7<>\"\",M7<>\"\",O7<>\"\"),Q7<>\"\"),AND(OR(C7<>\"\",E7<>\"\",G7<>\"\",I7<>\"\",K7<>\"\",M7<>\"\",O7<>\"\"),R7<>\"\"),AND(Q7<>\"\",R7<>\"\")),\"Fehler\",\"\")","v":""}]
["1.3.","Mi",null,null,null,null,null,null,null,null,null,null,null,null,null,null,null,null,{"$f":"IF(R8=INTERN!$A$4,$R$1,\"0\")","v":"0"},null,0,null,null,null,null,""]
["2.3.","Do",null,null,null,null,null,null,null,null,null,null,null,null,null,null,null,null,{"$f":"IF(R9=INTERN!$A$4,$R$1,\"0\")","v":"0"},null,0,null,null,null,null,""]
["3.3.","Fr",null,null,null,null,null,null,null,null,null,null,null,null,null,null,null,null,{"$f":"R10*R1","v":0},null,0,null,null,null,null,""]
["4.3.","Sa",null,null,null,null,null,null,null,null,null,null,null,null,null,null,null,null,null,null,{"$f":"SUM(C11:O11)","v":0},null,null,null,null,""]
["5.3.","So",null,null,null,null,null,null,null,null,null,null,null,null,null,null,null,null,null,null,{"$f":"SUM(C12:O12)","v":0},{"$f":"SUM(U6:U12)","v":0},{"$f":"Februar!W44-März!V12","v":1287},{"$f":"(W12*100)/U1","v":100},null,""]
["6.3.","Mo",null,null,null,null,null,null,null,null,null,null,null,null,null,null,null,null,{"$f":"IF(R13=INTERN!$A$4,$R$1,\"0\")","v":"0"},null,0,null,null,null,null,""]
["7.3.","Die",null,null,null,null,null,null,null,null,null,null,null,null,null,null,null,null,{"$f":"IF(R14=INTERN!$A$4,$R$1,\"0\")","v":"0"},null,0,null,null,null,null,""]
["8.3.","Mi",null,null,null,null,null,null,null,null,null,null,null,null,null,null,null,null,{"$f":"IF(R15=INTERN!$A$4,$R$1,\"0\")","v":"0"},null,0,null,null,null,null,""]
["9.3.","Do",null,null,null,null,null,null,null,null,null,null,null,null,null,null,null,null,{"$f":"IF(R16=INTERN!$A$4,$R$1,\"0\")","v":"0"},null,0,null,null,null,null,""]
["10.3.","Fr",null,null,null,null,null,null,null,null,null,null,null,null,null,null,null,null,{"$f":"R17*R1","v":0},null,0,null,null,null,null,""]
["11.3.","Sa",null,null,null,null,null,null,null,null,null,null,null,null,null,null,null,null,null,null,{"$f":"SUM(C18:O18)","v":0},null,null,null,null,""]
["12.3.","So",null,null,null,null,null,null,null,null,null,null,null,null,null,null,null,null,null,null,{"$f":"SUM(C19:O19)","v":0},{"$f":"SUM(U13:U19)","v":0},{"$f":"W12-V19","v":1287},{"$f":"(W19*100)/U1","v":100},null,""]
["13.3.","Mo",null,null,null,null,null,null,null,null,null,null,null,null,null,null,null,null,{"$f":"IF(R20=INTERN!$A$4,$R$1,\"0\")","v":"0"},null,0," ",null,null,null,""]
["14.3.","Die",null,null,null,null,null,null,null,null,null,null,null,null,null,null,null,null,{"$f":"IF(R21=INTERN!$A$4,$R$1,\"0\")","v":"0"},null,0,null,null,null,null,""]
["15.3.","Mi",null,null,null,null,null,null,null,null,null,null,null,null,null,null,null,null,{"$f":"IF(R22=INTERN!$A$4,$R$1,\"0\")","v":"0"},null,0,null,null,null,null,""]
["16.3.","Do",null,null,null,null,null,null,null,null,null,null,null,null,null,null,null,null,{"$f":"IF(R23=INTERN!$A$4,$R$1,\"0\")","v":"0"},null,0,null,null,null,null,""]
["17.3.","Fr",null,null,null,null,null,null,null,null,null,null,null,null,null,null,null,null,{"$f":"R24*R1","v":0},null,0,null,null,null,null,""]
["18.3.","Sa",null,null,null,null,null,null,null,null,null,null,null,null,null,null,null,null,null,null,{"$f":"SUM(C25:O25)","v":0},null,null,null,null,""]
["19.3.","So",null,null,null,null,null,null,null,null,null,null,null,null,null,null,null,null,null,null,{"$f":"SUM(C26:O26)","v":0},{"$f":"SUM(U20:U26)","v":0},{"$f":"W19-V26","v":1287},{"$f":"(W26*100)/U1","v":100},null,""]
["20.3.","Mo",null,null,null,null,null,null,null,null,null,null,null,null,null,null,null,null,{"$f":"IF(R27=INTERN!$A$4,$R$1,\"0\")","v":"0"},null,0,null,null,null,null,""]
["21.3.","Die",null,null,null,null,null,null,null,null,null,null,null,null,null,null,null,null,{"$f":"IF(R28=INTERN!$A$4,$R$1,\"0\")","v":"0"},null,0,null,null,null,null,""]
["22.3.","Mi",null,null,null,null,null,null,null,null,null,null,null,null,null,null,null,null,{"$f":"IF(R29=INTERN!$A$4,$R$1,\"0\")","v":"0"},null,0,null,null,null,null,""]
["23.3.","Do",null,null,null,null,null,null,null,null,null,null,null,null,null,null,null,null,{"$f":"IF(R30=INTERN!$A$4,$R$1,\"0\")","v":"0"},null,0,null,null,null,null,""]
["24.3.","Fr",null,null,null,null,null,null,null,null,null,null,null,null,null,null,null,null,{"$f":"R31*R1","v":0},null,0,null,null,null,null,""]
["25.3.","Sa",null,null,null,null,null,null,null,null,null,null,null,null,null,null,null,null,null,null,{"$f":"SUM(C32:O32)","v":0},null,null,null,null,""]
["26.3.","So",null,null,null,null,null,null,null,null,null,null,null,null,null,null,null,null,null,null,{"$f":"SUM(C33:O33)","v":0},{"$f":"SUM(U27:U33)","v":0},{"$f":"W26-V33","v":1287},{"$f":"(W33*100)/U1","v":100},null,{"$f":"IF(OR(AND(OR(C33<>\"\",E33<>\"\",G33<>\"\",I33<>\"\",K33<>\"\",M33<>\"\",O33<>\"\"),Q33<>\"\"),AND(OR(C33<>\"\",E33<>\"\",G33<>\"\",I33<>\"\",K33<>\"\",M33<>\"\",O33<>\"\"),R33<>\"\"),AND(Q33<>\"\",R33<>\"\")),\"Fehler\",\"\")","v":""}]
["27.3.","Mo",null,null,null,null,null,null,null,null,null,null,null,null,null,null,null,null,{"$f":"IF(R34=INTERN!$A$4,$R$1,\"0\")","v":"0"},null,0,null,null,null,null,""]
["28.3.","Die",null,null,null,null,null,null,null,null,null,null,null,null,null,null,null,null,{"$f":"IF(R35=INTERN!$A$4,$R$1,\"0\")","v":"0"},null,0,null,null,null,null,""]
["29.3.","Mi",null,null,null,null,null,null,null,null,null,null,null,null,null,null,null,null,{"$f":"IF(R36=INTERN!$A$4,$R$1,\"0\")","v":"0"},null,0,null,null,null,null,""]
["30.3.","Do",null,null,null,null,null,null,null,null,null,null,null,null,null,null,null,null,{"$f":"IF(R37=INTERN!$A$4,$R$1,\"0\")","v":"0"},null,0,null,null,null,null,""]
["31.3.","Fr",null,null,null,null,null,null,null,null,null,null,null,null,null,null,null,null,{"$f":"R38*R1","v":0},null,0,null,null,null,null,""]
[null,"Sa",null,null,null,null,null,null,null,null,null,null,null,null,null,null,null,null,null,null,{"$f":"SUM(C39:O39)","v":0},null,null,null,null,""]
[null,"So",null,null,null,null,null,null,null,null,null,null,null,null,null,null,null,null,null,null,{"$f":"SUM(C40:O40)","v":0},{"$f":"SUM(U34:U40)","v":0},{"$f":"W33-V40","v":1287},{"$f":"(W40*100)/U1","v":100},null,""]
[null,"Mo",null,null,null,null,null,null,null,null,null,null,null,null,null,null,null,null,{"$f":"IF(R41=INTERN!$A$4,$R$1,\"0\")","v":"0"},null,0,null,null,null,null,""]
[null,"Di",null,null,null,null,null,null,null,null,null,null,null,null,null,null,null,null,{"$f":"IF(R42=INTERN!$A$4,$R$1,\"0\")","v":"0"},null,0,null,null,null,null,""]
[null,"Mi",null,null,null,null,null,null,null,null,null,null,null,null,null,null,null,null,{"$f":"IF(R43=INTERN!$A$4,$R$1,\"0\")","v":"0"},null,0,null,null,null,null,""]
[null,"Do",null,null,null,null,null,null,null,null,null,null,null,null,null,null,null,null,{"$f":"IF(R44=INTERN!$A$4,$R$1,\"0\")","v":"0"},null,0,{"$f":"SUM(U41:U44)","v":0},{"$f":"W40-V44","v":1287},{"$f":"(W44*100)/U1","v":100},null,""]
[null,null,"gesamt",{"$f":"SUM(C6:D44)","v":0},"gesamt",{"$f":"SUM(E6:F44)","v":0},"gesamt",{"$f":"SUM(G6:G44)","v":0},"gesamt",{"$f":"SUM(I6:J44)","v":0},"gesamt",{"$f":"SUM(K6:L44)","v":0},"gesamt",{"$f":"SUM(M6:N44)","v":0},"gesamt",{"$f":"SUM(O6:P44)","v":0},{"$f":"SUM(Q6:Q44)","v":0},null,{"$f":"SUM(S6:S44)","v":0},null,null,null,null,"AUSDRUCK-ÜBERSICHT\n (Hier klicken)"]
[]
["1 Spalte O/P: Die SpalteTagesarbeitszeit wird  im MODELL  A ausgefüllt. Dabei ist hier jeweils die Gesamtarbeitszeit pro Tag in einer Summe einzutragen. Eine  Aufteilung in einzelne Arbeitsbereiche wird nur im MODELL B vorgenommen (in Spalte C bis L). \nFür die Darstellung von MODELL A wird über der Spaltenbeschriftung im Kopf (M) auf das Minus geklickt. Überflüssige Spalten werden damit ausgeblendet. (Siehe auch Arbeitshilfe.) Für die Darstellung von MODELL B wird auf das Plus-Zeichen über Spalte O geklickt. "]
["2  Spalte Q: An Urlaubstagen ist immer die Zahl 1 (und nichts anderes) einzutragen. Zusätzlich ist darauf zu achten, dass an Urlaubstagen keine Arbeitszeit ausgefüllt wird. (Sonst würde der Widerspruch in der Tabelle dargestellt, dass an Urlaubstagen gearbeitet wird. Technisch lässt sich diese Fehldarstellung nicht ausschließen, sodass dieser Hinweis selber beachtet werden muss.) ACHTUNG: Weil an Wochendenen  keine Krankheits- und Urlaubstage eingetragen werden dürfen, sind diese Felder gesperrt. An gesetzlichen Feiertagen dürfen ebenfalls keine Urlaubstage eingetragen werden. \nMitarbeitende mit einer 6-Tage-Woche können Krankheits- und Urlaubstage jeweils freitags mit hinzuzählen. Alle anderen Wochentage sind jeweils nur für eine \"1\" freigegeben."]
["3 Spalte R/S: Je Krankheitstag oder/und personenbezogener Freistellung (Freistellung für Krankheit Kinder, Zusatzfreistellungstage z.B. für Kinder und Pflege) mit einer \"1\" angeben. Angerechnet wird zur Arbeitszeit die \"reguläre tägliche AZ im GP- oder Kirchenmusikalischen Dienst\" (Feld R1). ACHTUNG: Weil an Wochendenen  keine Krankheits- und Urlaubstagstage eingetragen werden dürfen, sind diese Felder gesperrt. An gesetzlichen Feiertagen dürfen ebenfalls keine Krankheitstage eingetragen werden. \nMitarbeitende mit einer 6-Tage-Woche können Krankheitstage jeweils freitags mit hinzuzählen (statt eine 1 eine 2 eintragen). Alle anderen Wochentage sind jeweils nur für eine \"1\" freigegeben."]
["4 Spalte T: Hier werden die Arbeitsorte des jeweiligen Tages eingetragen. Wegen der  begrenzten Spaltengröße empfiehlt es sich, eigene Kürzel festzulegen."]
["5 Spalte U, Zeile 4 und 5: JAHR-SOLL entspricht der Jahresplanung; JAHR-IST enthält die tagesaktuelle, schon geleistete AZ in diesem Bereich. "]
["6 Spalte Y: Platz für Anmerkungen.  ACHTUNG: Die Schrift passt sich der Größe des Feldes an. Bei viel Text wird die Schrift sehr klein. Im Bedarfsfall kann im Eingabefeld der Text angeschaut werden. Diese Form ist notwendig, um einen Ausdruck zu ermöglichen."]

{"sheet":"April","index":7,"n_rows":52,"n_cols":26,"rows_kept":52,"cut":false,"hidden":false,"merged":[[0,21,0,25],[1,21,1,25],[10,16,11,18],[17,16,18,18],[24,16,25,18],[31,16,32,18],[5,21,10,21],[5,22,10,22],[5,23,10,23],[2,17,2,18],[26,23,31,23],[38,16,39,18],[0,0,0,11],[0,14,0,16],[0,17,0,18],[3,0,3,1],[3,2,3,3],[1,0,1,13],[2,2,2,3],[2,4,2,5],[2,6,2,7],[4,0,4,1],[4,2,4,3],[4,4,4,5],[4,6,4,7],[4,8,4,9],[4,10,4,11],[2,8,2,9],[2,10,2,11],[2,12,2,13],[4,12,4,13],[4,14,4,15],[5,2,5,3],[5,4,5,5],[5,6,5,7],[5,8,5,9],[5,10,5,11],[5,12,5,13],[5,14,5,15],[3,4,3,5],[3,6,3,7],[3,8,3,9],[3,10,3,11],[3,12,3,13],[3,14,3,15],[7,14,7,15],[8,14,8,15],[8,2,8,3],[8,4,8,5],[8,6,8,7],[8,8,8,9],[8,10,8,11],[8,12,8,13],[6,14,6,15],[7,2,7,3],[7,4,7,5],[7,6,7,7],[7,8,7,9],[7,10,7,11],[7,12,7,13],[6,2,6,3],[6,4,6,5],[6,6,6,7],[6,8,6,9],[6,10,6,11],[6,12,6,13],[11,2,11,3],[11,4,11,5],[11,6,11,7],[11,8,11,9],[11,10,11,11],[11,12,11,13],[9,4,9,5],[11,14,11,15],[9,14,9,15],[10,2,10,3],[10,4,10,5],[10,6,10,7],[10,8,10,9],[10,10,10,11],[10,12,10,13],[10,14,10,15],[9,2,9,3],[9,6,9,7],[9,8,9,9],[9,10,9,11],[9,12,9,13],[12,14,12,15],[12,21,17,21],[12,6,12,7],[12,8,12,9],[12,10,12,11],[12,12,12,13],[12,22,17,22],[12,23,17,23],[13,2,13,3],[13,4,13,5],[13,6,13,7],[13,8,13,9],[13,10,13,11],[13,12,13,13],[12,2,12,3],[12,4,12,5],[13,14,13,15],[14,14,14,15],[15,14,15,15],[14,2,14,3],[14,4,14,5],[14,6,14,7],[14,8,14,9],[14,10,14,11],[14,12,14,13],[15,2,15,3],[18,14,18,15],[17,2,17,3],[17,4,17,5],[17,6,17,7],[17,8,17,9],[17,10,17,11],[17,12,17,13],[18,2,18,3],[18,4,18,5],[16,14,16,15],[17,14,17,15],[16,2,16,3],[16,4,16,5],[16,6,16,7],[16,8,16,9],[16,10,16,11],[16,12,16,13],[15,4,15,5],[15,6,15,7],[15,8,15,9],[15,10,15,11],[15,12,15,13],[18,6,18,7],[18,8,18,9],[18,10,18,11],[18,12,18,13],[19,2,19,3],[19,4,19,5],[19,6,19,7],[19,8,19,9],[19,10,19,11],[19,12,19,13],[19,14,19,15],[19,21,24,21],[19,22,24,22],[19,23,24,23],[20,2,20,3],[20,4,20,5],[20,6,20,7],[20,8,20,9],[20,10,20,11],[20,12,20,13],[20,14,20,15],[21,14,21,15],[22,14,22,15],[21,2,21,3],[21,4,21,5],[21,6,21,7],[21,8,21,9],[21,10,21,11],[21,12,21,13],[22,2,22,3],[23,14,23,15],[23,2,23,3],[23,4,23,5],[23,6,23,7],[25,14,25,15],[24,2,24,3],[24,4,24,5],[24,6,24,7],[24,8,24,9],[24,10,24,11],[24,12,24,13],[25,2,25,3],[25,4,25,5],[24,14,24,15],[23,8,23,9],[23,10,23,11],[23,12,23,13],[22,4,22,5],[22,6,22,7],[22,8,22,9],[22,10,22,11],[22,12,22,13],[25,6,25,7],[25,8,25,9],[25,10,25,11],[25,12,25,13],[26,2,26,3],[26,4,26,5],[26,6,26,7],[26,8,26,9],[26,10,26,11],[26,12,26,13],[26,14,26,15],[26,21,31,21],[26,22,31,22],[27,2,27,3],[27,4,27,5],[27,6,27,7],[27,8,27,9],[27,10,27,11],[27,12,27,13],[27,14,27,15],[28,14,28,15],[29,14,29,15],[28,2,28,3],[28,4,28,5],[28,6,28,7],[28,8,28,9],[28,10,28,11],[28,12,28,13],[29,2,29,3],[32,14,32,15],[31,2,31,3],[31,4,31,5],[31,6,31,7],[31,8,31,9],[31,10,31,11],[31,12,31,13],[32,2,32,3],[32,4,32,5],[30,14,30,15],[31,14,31,15],[30,2,30,3],[30,4,30,5],[30,6,30,7],[30,8,30,9],[30,10,30,11],[30,12,30,13],[29,4,29,5],[29,6,29,7],[29,8,29,9],[29,10,29,11],[29,12,29,13],[32,6,32,7],[32,8,32,9],[32,10,32,11],[32,12,32,13],[33,2,33,3],[33,4,33,5],[33,6,33,7],[33,8,33,9],[33,10,33,11],[33,12,33,13],[33,14,33,15],[33,21,38,21],[33,22,38,22],[33,23,38,23],[34,2,34,3],[34,4,34,5],[34,6,34,7],[34,8,34,9],[34,10,34,11],[34,12,34,13],[34,14,34,15],[35,14,35,15],[36,14,36,15],[35,2,35,3],[35,4,35,5],[35,6,35,7],[35,8,35,9],[35,10,35,11],[35,12,35,13],[36,2,36,3],[37,14,37,15],[37,2,37,3],[37,4,37,5],[37,6,37,7],[39,14,39,15],[38,2,38,3],[38,4,38,5],[38,6,38,7],[38,8,38,9],[38,10,38,11],[38,12,38,13],[39,2,39,3],[39,4,39,5],[38,14,38,15],[37,8,37,9],[37,10,37,11],[37,12,37,13],[36,4,36,5],[36,6,36,7],[36,8,36,9],[36,10,36,11],[36,12,36,13],[39,6,39,7],[39,8,39,9],[39,10,39,11],[39,12,39,13],[40,2,40,3],[40,4,40,5],[40,6,40,7],[40,8,40,9],[40,10,40,11],[40,12,40,13],[40,21,42,21],[40,22,42,22],[40,23,42,23],[41,2,41,3],[41,4,41,5],[41,6,41,7],[41,8,41,9],[41,10,41,11],[41,12,41,13],[41,14,41,15],[42,14,42,15],[42,2,42,3],[42,4,42,5],[42,6,42,7],[42,8,42,9],[42,10,42,11],[42,12,42,13],[40,14,40,15],[44,19,45,22],[44,23,45,24],[50,0,50,24],[51,0,51,24],[43,14,43,15],[46,0,46,24],[47,0,47,24],[48,0,48,24],[49,0,49,24],[43,2,43,3],[43,4,43,5],[43,6,43,7],[43,8,43,9],[43,10,43,11],[43,12,43,13]]}
[{"$f":"Stammdaten!B3","v":0},null,null,null,null,null,null,null,null,null,null,null,null,null,{"$f":"Januar!O1","v":"reguläre tägliche AZ im GP-Dienst/ Kirchenmusik (Stunden)"},null,null,{"$f":"Stammdaten!B31","v":5.85},null,{"$f":"Januar!T1","v":"SOLL-AZ  im GP/KM-Dienst (Stunden)"},{"$f":"Stammdaten!B26","v":1287},"APRIL"]
[null,null,null,null,null,null,null,null,null,null,null,null,null,null,"a)  Angaben in Stunden (Bsp. 1,00=60min; 1,5=90min; 0,75=45min; 0,25=15min)",null,null,null,null,null,null,{"$f":"Januar!V2","v":"b)  Die Felder in dieser Farbe werden automatisch ausgefüllt."}]
[null,"Tag",{"$f":"'2023'!B6","v":"1) Regelmäßige Veranstaltungen "},null,{"$f":"'2023'!C6","v":"2) Einzelveranstaltungen, Projekte, Freizeiten, besondere Dienste "},null,{"$f":"'2023'!D6","v":"3) Gremien, Konvente"},null,{"$f":"'2023'!E6","v":"4) Sonstige Dienstpflichten "},null,{"$f":"'2023'!F6","v":"5) Entwicklung neuer Arbeitsansätze / Unvorhersehbares / seelsorgerische Begleitung Einzelner"},null,{"$f":"'2023'!G6","v":"6) sonstige Arbeitsfelder (z.B. Kirchenmusik) "},null,{"$f":"'2023'!H6","v":"Tagesarbeitszeit"},"siehe 1","Urlaub - Tag je als 1 eintragen  2","Krankheit und weitere personenbezogene  Freistellungen - Tag je als \"1\" eintragen 3",null,"Ort 4","geleistete AZ 5","geleistete Wochenstunden","Restarbeitszeit Jahr","verbleibende AZ im Jahr in Prozent","Anmerkung / Hinweis / Begründung 6",{"$f":"Januar!Z3","v":"Plausibilitätsprüfung "}]
["JAHR-SOLL",null,{"$f":"Stammdaten!B34","v":0},null,{"$f":"Stammdaten!B35","v":0},null,{"$f":"Stammdaten!B36","v":0},null,{"$f":"Stammdaten!B37","v":0},null,{"$f":"Stammdaten!B38","v":0},null,{"$f":"Stammdaten!B39","v":0},null,{"$f":"Stammdaten!B26","v":1287},null,{"$f":"Stammdaten!B7","v":30},"Tag 3"," Umrechnung in Stunden",null,{"$f":"Stammdaten!B26","v":1287}]
["JAHR-IST",null,{"$f":"'2023'!B8","v":0},null,{"$f":"'2023'!C8","v":0},null,{"$f":"'2023'!D8","v":0},null,{"$f":"'2023'!E8","v":0},null,{"$f":"'2023'!F8","v":0},null,{"$f":"'2023'!G8","v":0},null,{"$f":"'2023'!H8","v":0},null,{"$f":"März!Q5-April!Q45","v":30},null,{"$f":"SUM(S6:S44)","v":0},null,{"$f":"U4-W44","v":0}]
[null,"Mo",null,null,null,null,null,null,null,null,null,null,null,null,null,null,null,null,{"$f":"IF(R6=INTERN!$A$4,$R$1,\"0\")","v":"0"},null,{"$f":"SUM(C6:O6)+S6","v":0},null,null,null,null,{"$f":"IF(OR(AND(OR(C6<>\"\",E6<>\"\",G6<>\"\",I6<>\"\",K6<>\"\",M6<>\"\",O6<>\"\"),Q6<>\"\"),AND(OR(C6<>\"\",E6<>\"\",G6<>\"\",I6<>\"\",K6<>\"\",M6<>\"\",O6<>\"\"),R6<>\"\"),AND(Q6<>\"\",R6<>\"\")),\"Fehler\",\"\")","v":""}]
[null,"Die",null,null,null,null,null,null,null,null,null,null,null,null,null,null,null,null,{"$f":"IF(R7=INTERN!$A$4,$R$1,\"0\")","v":"0"},null,{"$f":"SUM(C7:O7)+S7","v":0},null,null,null,null,{"$f":"IF(OR(AND(OR(C7<>\"\",E7<>\"\",G7<>\"\",I7<>\"\",K7<>\"\",M7<>\"\",O7<>\"\"),Q7<>\"\"),AND(OR(C7<>\"\",E7<>\"\",G7<>\"\",I7<>\"\",K7<>\"\",M7<>\"\",O7<>\"\"),R7<>\"\"),AND(Q7<>\"\",R7<>\"\")),\"Fehler\",\"\")","v":""}]
[null,"Mi",null,null,null,null,null,null,null,null,null,null,null,null,null,null,null,null,{"$f":"IF(R8=INTERN!$A$4,$R$1,\"0\")","v":"0"},null,0,null,null,null,null,""]
[null,"Do",null,null,null,null,null,null,null,null,null,null,null,null,null,null,null,null,{"$f":"IF(R9=INTERN!$A$4,$R$1,\"0\")","v":"0"},null,0,null,null,null,null,""]
[null,"Fr",null,null,null,null,null,null,null,null,null,null,null,null,null,null,null,null,{"$f":"R10*R1","v":0},null,0,null,null,null,null,""]
["1.4.","Sa",null,null,null,null,null,null,null,null,null,null,null,null,null,null,null,null,null,null,{"$f":"SUM(C11:O11)","v":0},null,null,null,null,""]
["2.4.","So",null,null,null,null,null,null,null,null,null,null,null,null,null,null,null,null,null,null,{"$f":"SUM(C12:O12)","v":0},{"$f":"SUM(U6:U12)","v":0},{"$f":"März!W44-April!V12","v":1287},{"$f":"(W12*100)/U1","v":100},null,""]
["3.4.","Mo",null,null,null,null,null,null,null,null,null,null,null,null,null,null,null,null,{"$f":"IF(R13=INTERN!$A$4,$R$1,\"0\")","v":"0"},null,0,null,null,null,null,""]
["4.4.","Die",null,null,null,null,null,null,null,null,null,null,null,null,null,null,null,null,{"$f":"IF(R14=INTERN!$A$4,$R$1,\"0\")","v":"0"},null,0,null,null,null,null,""]
["5.4.","Mi",null,null,null,null,null,null,null,null,null,null,null,null,null,null,null,null,{"$f":"IF(R15=INTERN!$A$4,$R$1,\"0\")","v":"0"},null,0,null,null,null,null,""]
["6.4.","Do",null,null,null,null,null,null,null,null,null,null,null,null,null,null,null,null,{"$f":"IF(R16=INTERN!$A$4,$R$1,\"0\")","v":"0"},null,0,null,null,null,null,""]
["7.4.","Fr",null,null,null,null,null,null,null,null,null,null,null,null,null,null,null,null,{"$f":"R17*R1","v":0},null,0,null,null,null,null,""]
["8.4.","Sa",null,null,null,null,null,null,null,null,null,null,null,null,null,null,null,null,null,null,{"$f":"SUM(C18:O18)","v":0},null,null,null,null,""]
["9.4.","So",null,null,null,null,null,null,null,null,null,null,null,null,null,null,null,null,null,null,{"$f":"SUM(C19:O19)","v":0},{"$f":"SUM(U13:U19)","v":0},{"$f":"W12-V19","v":1287},{"$f":"(W19*100)/U1","v":100},null,""]
["10.4.","Mo",null,null,null,null,null,null,null,null,null,null,null,null,null,null,null,null,{"$f":"IF(R20=INTERN!$A$4,$R$1,\"0\")","v":"0"},null,0," ",null,null,null,""]
["11.4.","Die",null,null,null,null,null,null,null,null,null,null,null,null,null,null,null,null,{"$f":"IF(R21=INTERN!$A$4,$R$1,\"0\")","v":"0"},null,0,null,null,null,null,""]
["12.4.","Mi",null,null,null,null,null,null,null,null,null,null,null,null,null,null,null,null,{"$f":"IF(R22=INTERN!$A$4,$R$1,\"0\")","v":"0"},null,0,null,null,null,null,""]
["13.4.","Do",null,null,null,null,null,null,null,null,null,null,null,null,null,null,null,null,{"$f":"IF(R23=INTERN!$A$4,$R$1,\"0\")","v":"0"},null,0,null,null,null,null,""]
["14.4.","Fr",null,null,null,null,null,null,null,null,null,null,null,null,null,null,null,null,{"$f":"R24*R1","v":0},null,0,null,null,null,null,""]
["15.4.","Sa",null,null,null,null,null,null,null,null,null,null,null,null,null,null,null,null,null,null,{"$f":"SUM(C25:O25)","v":0},null,null,null,null,""]
["16.4.","So",null,null,null,null,null,null,null,null,null,null,null,null,null,null,null,null,null,null,{"$f":"SUM(C26:O26)","v":0},{"$f":"SUM(U20:U26)","v":0},{"$f":"W19-V26","v":1287},{"$f":"(W26*100)/U1","v":100},null,""]
["17.4.","Mo",null,null,null,null,null,null,null,null,null,null,null,null,null,null,null,null,{"$f":"IF(R27=INTERN!$A$4,$R$1,\"0\")","v":"0"},null,0,null,null,null,null,""]
["18.4.","Die",null,null,null,null,null,null,null,null,null,null,null,null,null,null,null,null,{"$f":"IF(R28=INTERN!$A$4,$R$1,\"0\")","v":"0"},null,0,null,null,null,null,""]
["19.4.","Mi",null,null,null,null,null,null,null,null,null,null,null,null,null,null,null,null,{"$f":"IF(R29=INTERN!$A$4,$R$1,\"0\")","v":"0"},null,0,null,null,null,null,""]
["20.4.","Do",null,null,null,null,null,null,null,null,null,null,null,null,null,null,null,null,{"$f":"IF(R30=INTERN!$A$4,$R$1,\"0\")","v":"0"},null,0,null,null,null,null,""]
["21.4.","Fr",null,null,null,null,null,null,null,null,null,null,null,null,null,null,null,null,{"$f":"R31*R1","v":0},null,0,null,null,null,null,""]
["22.4.","Sa",null,null,null,null,null,null,null,null,null,null,null,null,null,null,null,null,null,null,{"$f":"SUM(C32:O32)","v":0},null,null,null,null,""]
["23.4.","So",null,null,null,null,null,null,null,null,null,null,null,null,null,null,null,null,null,null,{"$f":"SUM(C33:O33)","v":0},{"$f":"SUM(U27:U33)","v":0},{"$f":"W26-V33","v":1287},{"$f":"(W33*100)/U1","v":100},null,{"$f":"IF(OR(AND(OR(C33<>\"\",E33<>\"\",G33<>\"\",I33<>\"\",K33<>\"\",M33<>\"\",O33<>\"\"),Q33<>\"\"),AND(OR(C33<>\"\",E33<>\"\",G33<>\"\",I33<>\"\",K33<>\"\",M33<>\"\",O33<>\"\"),R33<>\"\"),AND(Q33<>\"\",R33<>\"\")),\"Fehler\",\"\")","v":""}]
["24.4.","Mo",null,null,null,null,null,null,null,null,null,null,null,null,null,null,null,null,{"$f":"IF(R34=INTERN!$A$4,$R$1,\"0\")","v":"0"},null,0,null,null,null,null,""]
["25.4.","Die",null,null,null,null,null,null,null,null,null,null,null,null,null,null,null,null,{"$f":"IF(R35=INTERN!$A$4,$R$1,\"0\")","v":"0"},null,0,null,null,null,null,""]
["26.4.","Mi",null,null,null,null,null,null,null,null,null,null,null,null,null,null,null,null,{"$f":"IF(R36=INTERN!$A$4,$R$1,\"0\")","v":"0"},null,0,null,null,null,null,""]
["27.4.","Do",null,null,null,null,null,null,null,null,null,null,null,null,null,null,null,null,{"$f":"IF(R37=INTERN!$A$4,$R$1,\"0\")","v":"0"},null,0,null,null,null,null,""]
["28.4.","Fr",null,null,null,null,null,null,null,null,null,null,null,null,null,null,null,null,{"$f":"R38*R1","v":0},null,0,null,null,null,null,""]
["29.4.","Sa",null,null,null,null,null,null,null,null,null,null,null,null,null,null,null,null,null,null,{"$f":"SUM(C39:O39)","v":0},null,null,null,null,""]
["30.4.","So",null,null,null,null,null,null,null,null,null,null,null,null,null,null,null,null,null,null,{"$f":"SUM(C40:O40)","v":0},{"$f":"SUM(U34:U40)","v":0},{"$f":"W33-V40","v":1287},{"$f":"(W40*100)/U1","v":100},null,""]
[null,"Mo",null,null,null,null,null,null,null,null,null,null,null,null,null,null,null,null,{"$f":"IF(R41=INTERN!$A$4,$R$1,\"0\")","v":"0"},null,0,null,null,null,null,""]
[null,"Di",null,null,null,null,null,null,null,null,null,null,null,null,null,null,null,null,{"$f":"IF(R42=INTERN!$A$4,$R$1,\"0\")","v":"0"},null,0,null,null,null,null,""]
[null,"Mi",null,null,null,null,null,null,null,null,null,null,null,null,null,null,null,null,{"$f":"IF(R43=INTERN!$A$4,$R$1,\"0\")","v":"0"},null,0,null,null,null,null,""]
[null,"Do",null,null,null,null,null,null,null,null,null,null,null,null,null,null,null,null,{"$f":"IF(R44=INTERN!$A$4,$R$1,\"0\")","v":"0"},null,0,{"$f":"SUM(U41:U44)","v":0},{"$f":"W40-V44","v":1287},{"$f":"(W44*100)/U1","v":100},null,""]
[null,null,"gesamt",{"$f":"SUM(C6:D44)","v":0},"gesamt",{"$f":"SUM(E6:F44)","v":0},"gesamt",{"$f":"SUM(G6:G44)","v":0},"gesamt",{"$f":"SUM(I6:J44)","v":0},"gesamt",{"$f":"SUM(K6:L44)","v":0},"gesamt",{"$f":"SUM(M6:N44)","v":0},"gesamt",{"$f":"SUM(O6:P44)","v":0},{"$f":"SUM(Q6:Q44)","v":0},null,{"$f":"SUM(S6:S44)","v":0},null,null,null,null,"AUSDRUCK-ÜBERSICHT\n (Hier klicken)"]
[]
["1 Spalte O/P: Die SpalteTagesarbeitszeit wird  im MODELL  A ausgefüllt. Dabei ist hier jeweils die Gesamtarbeitszeit pro Tag in einer Summe einzutragen. Eine  Aufteilung in einzelne Arbeitsbereiche wird nur im MODELL B vorgenommen (in Spalte C bis L). \nFür die Darstellung von MODELL A wird über der Spaltenbeschriftung im Kopf (M) auf das Minus geklickt. Überflüssige Spalten werden damit ausgeblendet. (Siehe auch Arbeitshilfe.) Für die Darstellung von MODELL B wird auf das Plus-Zeichen über Spalte O geklickt. "]
["2  Spalte Q: An Urlaubstagen ist immer die Zahl 1 (und nichts anderes) einzutragen. Zusätzlich ist darauf zu achten, dass an Urlaubstagen keine Arbeitszeit ausgefüllt wird. (Sonst würde der Widerspruch in der Tabelle dargestellt, dass an Urlaubstagen gearbeitet wird. Technisch lässt sich diese Fehldarstellung nicht ausschließen, sodass dieser Hinweis selber beachtet werden muss.) ACHTUNG: Weil an Wochendenen  keine Krankheits- und Urlaubstage eingetragen werden dürfen, sind diese Felder gesperrt. An gesetzlichen Feiertagen dürfen ebenfalls keine Urlaubstage eingetragen werden. \nMitarbeitende mit einer 6-Tage-Woche können Krankheits- und Urlaubstage jeweils freitags mit hinzuzählen. Alle anderen Wochentage sind jeweils nur für eine \"1\" freigegeben."]
["3 Spalte R/S: Je Krankheitstag oder/und personenbezogener Freistellung (Freistellung für Krankheit Kinder, Zusatzfreistellungstage z.B. für Kinder und Pflege) mit einer \"1\" angeben. Angerechnet wird zur Arbeitszeit die \"reguläre tägliche AZ im GP- oder Kirchenmusikalischen Dienst\" (Feld R1). ACHTUNG: Weil an Wochendenen  keine Krankheits- und Urlaubstagstage eingetragen werden dürfen, sind diese Felder gesperrt. An gesetzlichen Feiertagen dürfen ebenfalls keine Krankheitstage eingetragen werden. \nMitarbeitende mit einer 6-Tage-Woche können Krankheitstage jeweils freitags mit hinzuzählen (statt eine 1 eine 2 eintragen). Alle anderen Wochentage sind jeweils nur für eine \"1\" freigegeben."]
["4 Spalte T: Hier werden die Arbeitsorte des jeweiligen Tages eingetragen. Wegen der  begrenzten Spaltengröße empfiehlt es sich, eigene Kürzel festzulegen."]
["5 Spalte U, Zeile 4 und 5: JAHR-SOLL entspricht der Jahresplanung; JAHR-IST enthält die tagesaktuelle, schon geleistete AZ in diesem Bereich. "]
["6 Spalte Y: Platz für Anmerkungen.  ACHTUNG: Die Schrift passt sich der Größe des Feldes an. Bei viel Text wird die Schrift sehr klein. Im Bedarfsfall kann im Eingabefeld der Text angeschaut werden. Diese Form ist notwendig, um einen Ausdruck zu ermöglichen."]

{"sheet":"Mai","index":8,"n_rows":52,"n_cols":26,"rows_kept":52,"cut":false,"hidden":false,"merged":[[0,21,0,25],[1,21,1,25],[38,16,39,18],[10,16,11,18],[17,16,18,18],[24,16,25,18],[31,16,32,18],[33,21,38,21],[33,22,38,22],[33,23,38,23],[26,22,31,22],[12,23,17,23],[12,21,17,21],[12,22,17,22],[0,14,0,16],[0,17,0,18],[2,17,2,18],[4,14,4,15],[26,23,31,23],[26,21,31,21],[19,23,24,23],[20,14,20,15],[21,14,21,15],[13,14,13,15],[51,0,51,24],[43,14,43,15],[46,0,46,24],[47,0,47,24],[48,0,48,24],[49,0,49,24],[43,2,43,3],[43,4,43,5],[43,6,43,7],[44,19,45,22],[44,23,45,24],[40,21,42,21],[40,22,42,22],[40,23,42,23],[41,2,41,3],[41,4,41,5],[41,6,41,7],[41,8,41,9],[41,10,41,11],[50,0,50,24],[43,8,43,9],[43,10,43,11],[43,12,43,13],[41,14,41,15],[42,2,42,3],[42,4,42,5],[42,6,42,7],[42,8,42,9],[42,10,42,11],[42,12,42,13],[42,14,42,15],[39,2,39,3],[39,4,39,5],[39,6,39,7],[39,8,39,9],[39,10,39,11],[39,12,39,13],[41,12,41,13],[39,14,39,15],[38,2,38,3],[38,4,38,5],[40,2,40,3],[40,4,40,5],[40,6,40,7],[40,8,40,9],[40,10,40,11],[40,12,40,13],[40,14,40,15],[36,10,36,11],[36,12,36,13],[35,8,35,9],[35,10,35,11],[35,12,35,13],[36,14,36,15],[37,14,37,15],[38,14,38,15],[38,6,38,7],[38,8,38,9],[38,10,38,11],[38,12,38,13],[37,10,37,11],[37,12,37,13],[37,2,37,3],[37,4,37,5],[37,6,37,7],[37,8,37,9],[36,2,36,3],[36,4,36,5],[36,6,36,7],[35,2,35,3],[35,4,35,5],[35,6,35,7],[36,8,36,9],[33,2,33,3],[33,4,33,5],[33,6,33,7],[33,8,33,9],[33,10,33,11],[33,12,33,13],[33,14,33,15],[34,14,34,15],[35,14,35,15],[34,2,34,3],[34,4,34,5],[34,6,34,7],[34,8,34,9],[34,10,34,11],[34,12,34,13],[32,2,32,3],[32,4,32,5],[32,6,32,7],[32,8,32,9],[32,10,32,11],[32,12,32,13],[32,14,32,15],[31,2,31,3],[31,4,31,5],[31,6,31,7],[31,8,31,9],[31,10,31,11],[31,12,31,13],[31,14,31,15],[29,8,29,9],[29,10,29,11],[29,12,29,13],[30,12,30,13],[28,6,28,7],[30,2,30,3],[30,4,30,5],[30,6,30,7],[29,2,29,3],[29,4,29,5],[29,6,29,7],[28,2,28,3],[28,4,28,5],[28,8,28,9],[28,10,28,11],[27,2,27,3],[27,4,27,5],[27,6,27,7],[29,14,29,15],[30,14,30,15],[25,2,25,3],[25,4,25,5],[25,6,25,7],[26,14,26,15],[27,14,27,15],[28,14,28,15],[30,8,30,9],[30,10,30,11],[28,12,28,13],[25,8,25,9],[25,10,25,11],[25,12,25,13],[27,8,27,9],[27,10,27,11],[25,14,25,15],[27,12,27,13],[26,2,26,3],[26,4,26,5],[26,6,26,7],[26,8,26,9],[26,10,26,11],[26,12,26,13],[23,2,23,3],[23,4,23,5],[23,6,23,7],[22,2,22,3],[22,4,22,5],[22,6,22,7],[24,2,24,3],[24,4,24,5],[24,6,24,7],[23,8,23,9],[23,10,23,11],[19,21,24,21],[19,22,24,22],[20,12,20,13],[20,8,20,9],[20,10,20,11],[21,8,21,9],[21,10,21,11],[22,14,22,15],[23,14,23,15],[24,14,24,15],[22,8,22,9],[22,10,22,11],[22,12,22,13],[23,12,23,13],[24,8,24,9],[24,10,24,11],[24,12,24,13],[21,4,21,5],[21,6,21,7],[18,2,18,3],[18,4,18,5],[18,6,18,7],[18,8,18,9],[18,10,18,11],[18,12,18,13],[18,14,18,15],[19,2,19,3],[19,4,19,5],[19,6,19,7],[19,8,19,9],[19,10,19,11],[19,12,19,13],[19,14,19,15],[20,2,20,3],[20,4,20,5],[20,6,20,7],[21,2,21,3],[21,12,21,13],[17,2,17,3],[17,4,17,5],[15,4,15,5],[15,6,15,7],[17,6,17,7],[17,8,17,9],[17,10,17,11],[17,12,17,13],[15,14,15,15],[16,14,16,15],[17,14,17,15],[15,8,15,9],[15,10,15,11],[15,12,15,13],[14,14,14,15],[16,8,16,9],[16,10,16,11],[13,2,13,3],[13,4,13,5],[13,6,13,7],[13,8,13,9],[13,10,13,11],[14,8,14,9],[14,10,14,11],[14,12,14,13],[13,12,13,13],[16,12,16,13],[14,2,14,3],[14,4,14,5],[14,6,14,7],[16,2,16,3],[16,4,16,5],[16,6,16,7],[15,2,15,3],[11,14,11,15],[12,2,12,3],[12,4,12,5],[12,6,12,7],[12,8,12,9],[12,10,12,11],[12,12,12,13],[12,14,12,15],[11,2,11,3],[11,4,11,5],[10,6,10,7],[10,8,10,9],[10,10,10,11],[9,10,9,11],[11,6,11,7],[11,8,11,9],[11,10,11,11],[11,12,11,13],[8,12,8,13],[9,6,9,7],[10,12,10,13],[8,8,8,9],[8,10,8,11],[9,8,9,9],[9,12,9,13],[10,14,10,15],[8,6,8,7],[7,10,7,11],[7,12,7,13],[5,23,10,23],[6,2,6,3],[6,4,6,5],[6,6,6,7],[6,8,6,9],[6,10,6,11],[6,12,6,13],[6,14,6,15],[9,2,9,3],[9,4,9,5],[5,21,10,21],[5,22,10,22],[7,14,7,15],[8,2,8,3],[8,4,8,5],[5,14,5,15],[8,14,8,15],[9,14,9,15],[10,2,10,3],[10,4,10,5],[3,2,3,3],[7,2,7,3],[7,4,7,5],[7,6,7,7],[7,8,7,9],[3,4,3,5],[3,6,3,7],[3,8,3,9],[3,10,3,11],[3,14,3,15],[5,2,5,3],[0,0,0,11],[3,12,3,13],[4,0,4,1],[4,4,4,5],[3,0,3,1],[5,4,5,5],[5,6,5,7],[4,2,4,3],[5,8,5,9],[5,10,5,11],[1,0,1,13],[2,4,2,5],[2,6,2,7],[2,8,2,9],[2,12,2,13],[2,10,2,11],[2,2,2,3],[4,6,4,7],[4,8,4,9],[4,10,4,11],[5,12,5,13],[4,12,4,13]]}
[{"$f":"Stammdaten!B3","v":0},null,null,null,null,null,null,null,null,null,null,null,null,null,{"$f":"Januar!O1","v":"reguläre tägliche AZ im GP-Dienst/ Kirchenmusik (Stunden)"},null,null,{"$f":"Stammdaten!B31","v":5.85},null,{"$f":"Januar!T1","v":"SOLL-AZ  im GP/KM-Dienst (Stunden)"},{"$f":"Stammdaten!B26","v":1287},"MAI"]
[null,null,null,null,null,null,null,null,null,null,null,null,null,null,"a)  Angaben in Stunden (Bsp. 1,00=60min; 1,5=90min; 0,75=45min; 0,25=15min)",null,null,null,null,null,null,{"$f":"Januar!V2","v":"b)  Die Felder in dieser Farbe werden automatisch ausgefüllt."}]
[null,"Tag",{"$f":"'2023'!B6","v":"1) Regelmäßige Veranstaltungen "},null,{"$f":"'2023'!C6","v":"2) Einzelveranstaltungen, Projekte, Freizeiten, besondere Dienste "},null,{"$f":"'2023'!D6","v":"3) Gremien, Konvente"},null,{"$f":"'2023'!E6","v":"4) Sonstige Dienstpflichten "},null,{"$f":"'2023'!F6","v":"5) Entwicklung neuer Arbeitsansätze / Unvorhersehbares / seelsorgerische Begleitung Einzelner"},null,{"$f":"'2023'!G6","v":"6) sonstige Arbeitsfelder (z.B. Kirchenmusik) "},null,{"$f":"'2023'!H6","v":"Tagesarbeitszeit"},"siehe 1","Urlaub - Tag je als 1 eintragen  2","Krankheit und weitere personenbezogene  Freistellungen - Tag je als \"1\" eintragen 3",null,"Ort 4","geleistete AZ 5","geleistete Wochenstunden","Restarbeitszeit Jahr","verbleibende AZ im Jahr in Prozent","Anmerkung / Hinweis / Begründung 6",{"$f":"Januar!Z3","v":"Plausibilitätsprüfung "}]
["JAHR-SOLL",null,{"$f":"Stammdaten!B34","v":0},null,{"$f":"Stammdaten!B35","v":0},null,{"$f":"Stammdaten!B36","v":0},null,{"$f":"Stammdaten!B37","v":0},null,{"$f":"Stammdaten!B38","v":0},null,{"$f":"Stammdaten!B39","v":0},null,{"$f":"Stammdaten!B26","v":1287},null,{"$f":"Stammdaten!B7","v":30},"Tag 3"," Umrechnung in Stunden",null,{"$f":"Stammdaten!B26","v":1287}]
["JAHR-IST",null,{"$f":"'2023'!B8","v":0},null,{"$f":"'2023'!C8","v":0},null,{"$f":"'2023'!D8","v":0},null,{"$f":"'2023'!E8","v":0},null,{"$f":"'2023'!F8","v":0},null,{"$f":"'2023'!G8","v":0},null,{"$f":"'2023'!H8","v":0},null,{"$f":"April!Q5-Mai!Q45","v":30},null,{"$f":"SUM(S6:S44)","v":0},null,{"$f":"U4-W44","v":0}]
["1.5.","Mo",null,null,null,null,null,null,null,null,null,null,null,null,null,null,null,null,{"$f":"IF(R6=INTERN!$A$4,$R$1,\"0\")","v":"0"},null,{"$f":"SUM(C6:O6)+S6","v":0},null,null,null,null,{"$f":"IF(OR(AND(OR(C6<>\"\",E6<>\"\",G6<>\"\",I6<>\"\",K6<>\"\",M6<>\"\",O6<>\"\"),Q6<>\"\"),AND(OR(C6<>\"\",E6<>\"\",G6<>\"\",I6<>\"\",K6<>\"\",M6<>\"\",O6<>\"\"),R6<>\"\"),AND(Q6<>\"\",R6<>\"\")),\"Fehler\",\"\")","v":""}]
["2.5.","Die",null,null,null,null,null,null,null,null,null,null,null,null,null,null,null,null,{"$f":"IF(R7=INTERN!$A$4,$R$1,\"0\")","v":"0"},null,{"$f":"SUM(C7:O7)+S7","v":0},null,null,null,null,{"$f":"IF(OR(AND(OR(C7<>\"\",E7<>\"\",G7<>\"\",I7<>\"\",K7<>\"\",M7<>\"\",O7<>\"\"),Q7<>\"\"),AND(OR(C7<>\"\",E7<>\"\",G7<>\"\",I7<>\"\",K7<>\"\",M7<>\"\",O7<>\"\"),R7<>\"\"),AND(Q7<>\"\",R7<>\"\")),\"Fehler\",\"\")","v":""}]
["3.5.","Mi",null,null,null,null,null,null,null,null,null,null,null,null,null,null,null,null,{"$f":"IF(R8=INTERN!$A$4,$R$1,\"0\")","v":"0"},null,0,null,null,null,null,""]
["4.5.","Do",null,null,null,null,null,null,null,null,null,null,null,null,null,null,null,null,{"$f":"IF(R9=INTERN!$A$4,$R$1,\"0\")","v":"0"},null,0,null,null,null,null,""]
["5.5.","Fr",null,null,null,null,null,null,null,null,null,null,null,null,null,null,null,null,{"$f":"R10*R1","v":0},null,0,null,null,null,null,""]
["6.5.","Sa",null,null,null,null,null,null,null,null,null,null,null,null,null,null,null,null,null,null,{"$f":"SUM(C11:O11)","v":0},null,null,null,null,""]
["7.5.","So",null,null,null,null,null,null,null,null,null,null,null,null,null,null,null,null,null,null,{"$f":"SUM(C12:O12)","v":0},{"$f":"SUM(U6:U12)","v":0},{"$f":"April!W44-Mai!V12","v":1287},{"$f":"(W12*100)/U1","v":100},null,""]
["8.5.","Mo",null,null,null,null,null,null,null,null,null,null,null,null,null,null,null,null,{"$f":"IF(R13=INTERN!$A$4,$R$1,\"0\")","v":"0"},null,0,null,null,null,null,""]
["9.5.","Die",null,null,null,null,null,null,null,null,null,null,null,null,null,null,null,null,{"$f":"IF(R14=INTERN!$A$4,$R$1,\"0\")","v":"0"},null,0,null,null,null,null,""]
["10.5.","Mi",null,null,null,null,null,null,null,null,null,null,null,null,null,null,null,null,{"$f":"IF(R15=INTERN!$A$4,$R$1,\"0\")","v":"0"},null,0,null,null,null,null,""]
["11.5.","Do",null,null,null,null,null,null,null,null,null,null,null,null,null,null,null,null,{"$f":"IF(R16=INTERN!$A$4,$R$1,\"0\")","v":"0"},null,0,null,null,null,null,""]
["12.5.","Fr",null,null,null,null,null,null,null,null,null,null,null,null,null,null,null,null,{"$f":"R17*R1","v":0},null,0,null,null,null,null,""]
["13.5.","Sa",null,null,null,null,null,null,null,null,null,null,null,null,null,null,null,null,null,null,{"$f":"SUM(C18:O18)","v":0},null,null,null,null,""]
["14.5.","So",null,null,null,null,null,null,null,null,null,null,null,null,null,null,null,null,null,null,{"$f":"SUM(C19:O19)","v":0},{"$f":"SUM(U13:U19)","v":0},{"$f":"W12-V19","v":1287},{"$f":"(W19*100)/U1","v":100},null,""]
["15.5.","Mo",null,null,null,null,null,null,null,null,null,null,null,null,null,null,null,null,{"$f":"IF(R20=INTERN!$A$4,$R$1,\"0\")","v":"0"},null,0," ",null,null,null,""]
["16.5.","Die",null,null,null,null,null,null,null,null,null,null,null,null,null,null,null,null,{"$f":"IF(R21=INTERN!$A$4,$R$1,\"0\")","v":"0"},null,0,null,null,null,null,""]
["17.5.","Mi",null,null,null,null,null,null,null,null,null,null,null,null,null,null,null,null,{"$f":"IF(R22=INTERN!$A$4,$R$1,\"0\")","v":"0"},null,0,null,null,null,null,""]
["18.5.","Do",null,null,null,null,null,null,null,null,null,null,null,null,null,null,null,null,{"$f":"IF(R23=INTERN!$A$4,$R$1,\"0\")","v":"0"},null,0,null,null,null,null,""]
["19.5.","Fr",null,null,null,null,null,null,null,null,null,null,null,null,null,null,null,null,{"$f":"R24*R1","v":0},null,0,null,null,null,null,""]
["20.5.","Sa",null,null,null,null,null,null,null,null,null,null,null,null,null,null,null,null,null,null,{"$f":"SUM(C25:O25)","v":0},null,null,null,null,""]
["21.5.","So",null,null,null,null,null,null,null,null,null,null,null,null,null,null,null,null,null,null,{"$f":"SUM(C26:O26)","v":0},{"$f":"SUM(U20:U26)","v":0},{"$f":"W19-V26","v":1287},{"$f":"(W26*100)/U1","v":100},null,""]
["22.5.","Mo",null,null,null,null,null,null,null,null,null,null,null,null,null,null,null,null,{"$f":"IF(R27=INTERN!$A$4,$R$1,\"0\")","v":"0"},null,0,null,null,null,null,""]
["23.5.","Die",null,null,null,null,null,null,null,null,null,null,null,null,null,null,null,null,{"$f":"IF(R28=INTERN!$A$4,$R$1,\"0\")","v":"0"},null,0,null,null,null,null,""]
["24.5.","Mi",null,null,null,null,null,null,null,null,null,null,null,null,null,null,null,null,{"$f":"IF(R29=INTERN!$A$4,$R$1,\"0\")","v":"0"},null,0,null,null,null,null,""]
["25.5.","Do",null,null,null,null,null,null,null,null,null,null,null,null,null,null,null,null,{"$f":"IF(R30=INTERN!$A$4,$R$1,\"0\")","v":"0"},null,0,null,null,null,null,""]
["26.5.","Fr",null,null,null,null,null,null,null,null,null,null,null,null,null,null,null,null,{"$f":"R31*R1","v":0},null,0,null,null,null,null,""]
["27.5.","Sa",null,null,null,null,null,null,null,null,null,null,null,null,null,null,null,null,null,null,{"$f":"SUM(C32:O32)","v":0},null,null,null,null,""]
["28.5.","So",null,null,null,null,null,null,null,null,null,null,null,null,null,null,null,null,null,null,{"$f":"SUM(C33:O33)","v":0},{"$f":"SUM(U27:U33)","v":0},{"$f":"W26-V33","v":1287},{"$f":"(W33*100)/U1","v":100},null,{"$f":"IF(OR(AND(OR(C33<>\"\",E33<>\"\",G33<>\"\",I33<>\"\",K33<>\"\",M33<>\"\",O33<>\"\"),Q33<>\"\"),AND(OR(C33<>\"\",E33<>\"\",G33<>\"\",I33<>\"\",K33<>\"\",M33<>\"\",O33<>\"\"),R33<>\"\"),AND(Q33<>\"\",R33<>\"\")),\"Fehler\",\"\")","v":""}]
["29.5.","Mo",null,null,null,null,null,null,null,null,null,null,null,null,null,null,null,null,{"$f":"IF(R34=INTERN!$A$4,$R$1,\"0\")","v":"0"},null,0,null,null,null,null,""]
["30.5.","Die",null,null,null,null,null,null,null,null,null,null,null,null,null,null,null,null,{"$f":"IF(R35=INTERN!$A$4,$R$1,\"0\")","v":"0"},null,0,null,null,null,null,""]
["31.5.","Mi",null,null,null,null,null,null,null,null,null,null,null,null,null,null,null,null,{"$f":"IF(R36=INTERN!$A$4,$R$1,\"0\")","v":"0"},null,0,null,null,null,null,""]
[null,"Do",null,null,null,null,null,null,null,null,null,null,null,null,null,null,null,null,{"$f":"IF(R37=INTERN!$A$4,$R$1,\"0\")","v":"0"},null,0,null,null,null,null,""]
[null,"Fr",null,null,null,null,null,null,null,null,null,null,null,null,null,null,null,null,{"$f":"R38*R1","v":0},null,0,null,null,null,null,""]
[null,"Sa",null,null,null,null,null,null,null,null,null,null,null,null,null,null,null,null,null,null,{"$f":"SUM(C39:O39)","v":0},null,null,null,null,""]
[null,"So",null,null,null,null,null,null,null,null,null,null,null,null,null,null,null,null,null,null,{"$f":"SUM(C40:O40)","v":0},{"$f":"SUM(U34:U40)","v":0},{"$f":"W33-V40","v":1287},{"$f":"(W40*100)/U1","v":100},null,""]
[null,"Mo",null,null,null,null,null,null,null,null,null,null,null,null,null,null,null,null,{"$f":"IF(R41=INTERN!$A$4,$R$1,\"0\")","v":"0"},null,0,null,null,null,null,""]
[null,"Di",null,null,null,null,null,null,null,null,null,null,null,null,null,null,null,null,{"$f":"IF(R42=INTERN!$A$4,$R$1,\"0\")","v":"0"},null,0,null,null,null,null,""]
[null,"Mi",null,null,null,null,null,null,null,null,null,null,null,null,null,null,null,null,{"$f":"IF(R43=INTERN!$A$4,$R$1,\"0\")","v":"0"},null,0,null,null,null,null,""]
[null,"Do",null,null,null,null,null,null,null,null,null,null,null,null,null,null,null,null,{"$f":"IF(R44=INTERN!$A$4,$R$1,\"0\")","v":"0"},null,0,{"$f":"SUM(U41:U44)","v":0},{"$f":"W40-V44","v":1287},{"$f":"(W44*100)/U1","v":100},null,""]
[null,null,"gesamt",{"$f":"SUM(C6:D44)","v":0},"gesamt",{"$f":"SUM(E6:F44)","v":0},"gesamt",{"$f":"SUM(G6:G44)","v":0},"gesamt",{"$f":"SUM(I6:J44)","v":0},"gesamt",{"$f":"SUM(K6:L44)","v":0},"gesamt",{"$f":"SUM(M6:N44)","v":0},"gesamt",{"$f":"SUM(O6:P44)","v":0},{"$f":"SUM(Q6:Q44)","v":0},null,{"$f":"SUM(S6:S44)","v":0},null,null,null,null,"AUSDRUCK-ÜBERSICHT\n (Hier klicken)"]
[]
["1 Spalte O/P: Die SpalteTagesarbeitszeit wird  im MODELL  A ausgefüllt. Dabei ist hier jeweils die Gesamtarbeitszeit pro Tag in einer Summe einzutragen. Eine  Aufteilung in einzelne Arbeitsbereiche wird nur im MODELL B vorgenommen (in Spalte C bis L). \nFür die Darstellung von MODELL A wird über der Spaltenbeschriftung im Kopf (M) auf das Minus geklickt. Überflüssige Spalten werden damit ausgeblendet. (Siehe auch Arbeitshilfe.) Für die Darstellung von MODELL B wird auf das Plus-Zeichen über Spalte O geklickt. "]
["2  Spalte Q: An Urlaubstagen ist immer die Zahl 1 (und nichts anderes) einzutragen. Zusätzlich ist darauf zu achten, dass an Urlaubstagen keine Arbeitszeit ausgefüllt wird. (Sonst würde der Widerspruch in der Tabelle dargestellt, dass an Urlaubstagen gearbeitet wird. Technisch lässt sich diese Fehldarstellung nicht ausschließen, sodass dieser Hinweis selber beachtet werden muss.) ACHTUNG: Weil an Wochendenen  keine Krankheits- und Urlaubstage eingetragen werden dürfen, sind diese Felder gesperrt. An gesetzlichen Feiertagen dürfen ebenfalls keine Urlaubstage eingetragen werden. \nMitarbeitende mit einer 6-Tage-Woche können Krankheits- und Urlaubstage jeweils freitags mit hinzuzählen. Alle anderen Wochentage sind jeweils nur für eine \"1\" freigegeben."]
["3 Spalte R/S: Je Krankheitstag oder/und personenbezogener Freistellung (Freistellung für Krankheit Kinder, Zusatzfreistellungstage z.B. für Kinder und Pflege) mit einer \"1\" angeben. Angerechnet wird zur Arbeitszeit die \"reguläre tägliche AZ im GP- oder Kirchenmusikalischen Dienst\" (Feld R1). ACHTUNG: Weil an Wochendenen  keine Krankheits- und Urlaubstagstage eingetragen werden dürfen, sind diese Felder gesperrt. An gesetzlichen Feiertagen dürfen ebenfalls keine Krankheitstage eingetragen werden. \nMitarbeitende mit einer 6-Tage-Woche können Krankheitstage jeweils freitags mit hinzuzählen (statt eine 1 eine 2 eintragen). Alle anderen Wochentage sind jeweils nur für eine \"1\" freigegeben."]
["4 Spalte T: Hier werden die Arbeitsorte des jeweiligen Tages eingetragen. Wegen der  begrenzten Spaltengröße empfiehlt es sich, eigene Kürzel festzulegen."]
["5 Spalte U, Zeile 4 und 5: JAHR-SOLL entspricht der Jahresplanung; JAHR-IST enthält die tagesaktuelle, schon geleistete AZ in diesem Bereich. "]
["6 Spalte Y: Platz für Anmerkungen.  ACHTUNG: Die Schrift passt sich der Größe des Feldes an. Bei viel Text wird die Schrift sehr klein. Im Bedarfsfall kann im Eingabefeld der Text angeschaut werden. Diese Form ist notwendig, um einen Ausdruck zu ermöglichen."]

{"sheet":"Juni","index":9,"n_rows":52,"n_cols":26,"rows_kept":52,"cut":false,"hidden":false,"merged":[[24,16,25,18],[31,16,32,18],[38,16,39,18],[26,23,31,23],[19,23,24,23],[12,23,17,23],[33,22,38,22],[33,23,38,23],[17,16,18,18],[26,21,31,21],[33,21,38,21],[26,22,31,22],[12,21,17,21],[12,22,17,22],[50,0,50,24],[43,8,43,9],[43,10,43,11],[43,12,43,13],[41,14,41,15],[51,0,51,24],[43,14,43,15],[46,0,46,24],[47,0,47,24],[48,0,48,24],[44,19,45,22],[44,23,45,24],[49,0,49,24],[43,2,43,3],[43,4,43,5],[43,6,43,7],[42,2,42,3],[42,4,42,5],[42,6,42,7],[42,8,42,9],[42,10,42,11],[42,12,42,13],[42,14,42,15],[40,21,42,21],[40,22,42,22],[40,23,42,23],[41,2,41,3],[41,4,41,5],[41,6,41,7],[41,8,41,9],[41,10,41,11],[41,12,41,13],[39,14,39,15],[38,2,38,3],[38,4,38,5],[40,2,40,3],[40,4,40,5],[40,6,40,7],[40,8,40,9],[40,10,40,11],[40,12,40,13],[40,14,40,15],[39,2,39,3],[39,4,39,5],[39,6,39,7],[39,8,39,9],[39,10,39,11],[39,12,39,13],[37,2,37,3],[37,4,37,5],[37,6,37,7],[37,8,37,9],[38,6,38,7],[38,8,38,9],[35,14,35,15],[37,10,37,11],[37,12,37,13],[36,14,36,15],[37,14,37,15],[38,14,38,15],[38,10,38,11],[38,12,38,13],[35,2,35,3],[35,4,35,5],[35,6,35,7],[36,8,36,9],[36,10,36,11],[36,12,36,13],[36,2,36,3],[36,4,36,5],[36,6,36,7],[35,8,35,9],[35,10,35,11],[35,12,35,13],[33,2,33,3],[33,4,33,5],[33,6,33,7],[33,8,33,9],[33,10,33,11],[32,12,32,13],[33,12,33,13],[33,14,33,15],[34,2,34,3],[34,4,34,5],[34,6,34,7],[34,8,34,9],[34,10,34,11],[34,12,34,13],[32,14,32,15],[34,14,34,15],[32,2,32,3],[32,4,32,5],[32,6,32,7],[32,8,32,9],[32,10,32,11],[31,2,31,3],[31,4,31,5],[29,6,29,7],[30,8,30,9],[27,12,27,13],[30,12,30,13],[27,14,27,15],[28,14,28,15],[30,2,30,3],[30,4,30,5],[30,6,30,7],[29,2,29,3],[29,4,29,5],[29,14,29,15],[30,14,30,15],[27,2,27,3],[27,4,27,5],[28,4,28,5],[28,12,28,13],[24,6,24,7],[24,8,24,9],[24,10,24,11],[24,12,24,13],[21,6,21,7],[21,12,21,13],[31,14,31,15],[29,8,29,9],[29,10,29,11],[29,12,29,13],[26,6,26,7],[26,8,26,9],[26,10,26,11],[26,12,26,13],[31,6,31,7],[31,8,31,9],[31,10,31,11],[31,12,31,13],[28,6,28,7],[26,14,26,15],[30,10,30,11],[27,6,27,7],[27,8,27,9],[27,10,27,11],[25,2,25,3],[25,4,25,5],[25,6,25,7],[25,8,25,9],[25,10,25,11],[25,12,25,13],[26,2,26,3],[26,4,26,5],[28,8,28,9],[28,10,28,11],[28,2,28,3],[25,14,25,15],[24,2,24,3],[24,4,24,5],[19,21,24,21],[19,22,24,22],[20,12,20,13],[23,12,23,13],[20,14,20,15],[21,14,21,15],[23,2,23,3],[23,4,23,5],[23,6,23,7],[22,2,22,3],[22,4,22,5],[22,6,22,7],[22,14,22,15],[23,14,23,15],[24,14,24,15],[22,8,22,9],[22,10,22,11],[22,12,22,13],[19,8,19,9],[19,10,19,11],[19,12,19,13],[19,14,19,15],[23,10,23,11],[20,2,20,3],[20,4,20,5],[20,6,20,7],[20,8,20,9],[20,10,20,11],[21,8,21,9],[21,10,21,11],[23,8,23,9],[21,4,21,5],[21,2,21,3],[18,2,18,3],[18,4,18,5],[18,6,18,7],[18,8,18,9],[18,10,18,11],[18,12,18,13],[19,2,19,3],[19,4,19,5],[19,6,19,7],[13,12,13,13],[16,12,16,13],[13,14,13,15],[14,14,14,15],[15,4,15,5],[15,6,15,7],[18,14,18,15],[17,2,17,3],[17,4,17,5],[14,12,14,13],[17,6,17,7],[17,8,17,9],[17,10,17,11],[17,12,17,13],[15,14,15,15],[16,14,16,15],[17,14,17,15],[15,8,15,9],[15,10,15,11],[15,12,15,13],[16,10,16,11],[16,8,16,9],[13,2,13,3],[13,4,13,5],[13,6,13,7],[13,8,13,9],[13,10,13,11],[14,8,14,9],[14,10,14,11],[14,2,14,3],[16,2,16,3],[15,2,15,3],[12,2,12,3],[12,4,12,5],[12,6,12,7],[12,8,12,9],[14,4,14,5],[14,6,14,7],[16,4,16,5],[16,6,16,7],[12,10,12,11],[12,12,12,13],[12,14,12,15],[11,2,11,3],[11,4,11,5],[11,6,11,7],[11,8,11,9],[11,10,11,11],[11,12,11,13],[11,14,11,15],[8,8,8,9],[8,10,8,11],[8,14,8,15],[9,14,9,15],[10,6,10,7],[10,8,10,9],[10,10,10,11],[9,10,9,11],[9,12,9,13],[10,14,10,15],[9,6,9,7],[9,8,9,9],[5,23,10,23],[6,2,6,3],[6,4,6,5],[6,6,6,7],[6,8,6,9],[6,10,6,11],[6,12,6,13],[6,14,6,15],[9,2,9,3],[9,4,9,5],[5,21,10,21],[5,22,10,22],[7,14,7,15],[8,2,8,3],[8,4,8,5],[8,6,8,7],[7,10,7,11],[7,12,7,13],[10,2,10,3],[10,4,10,5],[10,16,11,18],[5,14,5,15],[8,12,8,13],[10,12,10,13],[4,0,4,1],[4,2,4,3],[4,4,4,5],[4,6,4,7],[4,8,4,9],[4,10,4,11],[7,6,7,7],[7,8,7,9],[4,12,4,13],[4,14,4,15],[5,2,5,3],[5,4,5,5],[5,6,5,7],[5,8,5,9],[5,10,5,11],[5,12,5,13],[7,2,7,3],[7,4,7,5],[3,0,3,1],[3,2,3,3],[3,4,3,5],[3,6,3,7],[3,8,3,9],[3,10,3,11],[3,12,3,13],[3,14,3,15],[2,2,2,3],[0,21,0,25],[1,21,1,25],[0,0,0,11],[0,14,0,16],[0,17,0,18],[2,17,2,18],[1,0,1,13],[2,4,2,5],[2,6,2,7],[2,8,2,9],[2,10,2,11],[2,12,2,13]]}
[{"$f":"Stammdaten!B3","v":0},null,null,null,null,null,null,null,null,null,null,null,null,null,{"$f":"Januar!O1","v":"reguläre tägliche AZ im GP-Dienst/ Kirchenmusik (Stunden)"},null,null,{"$f":"Stammdaten!B31","v":5.85},null,{"$f":"Januar!T1","v":"SOLL-AZ  im GP/KM-Dienst (Stunden)"},{"$f":"Stammdaten!B26","v":1287},"JUNI"]
[null,null,null,null,null,null,null,null,null,null,null,null,null,null,"a)  Angaben in Stunden (Bsp. 1,00=60min; 1,5=90min; 0,75=45min; 0,25=15min)",null,null,null,null,null,null,{"$f":"Januar!V2","v":"b)  Die Felder in dieser Farbe werden automatisch ausgefüllt."}]
[null,"Tag",{"$f":"'2023'!B6","v":"1) Regelmäßige Veranstaltungen "},null,{"$f":"'2023'!C6","v":"2) Einzelveranstaltungen, Projekte, Freizeiten, besondere Dienste "},null,{"$f":"'2023'!D6","v":"3) Gremien, Konvente"},null,{"$f":"'2023'!E6","v":"4) Sonstige Dienstpflichten "},null,{"$f":"'2023'!F6","v":"5) Entwicklung neuer Arbeitsansätze / Unvorhersehbares / seelsorgerische Begleitung Einzelner"},null,{"$f":"'2023'!G6","v":"6) sonstige Arbeitsfelder (z.B. Kirchenmusik) "},null,{"$f":"'2023'!H6","v":"Tagesarbeitszeit"},"siehe 1","Urlaub - Tag je als 1 eintragen 2","Krankheit und weitere personenbezogene  Freistellungen - Tag je als \"1\" eintragen 3",null,"Ort 4","geleistete AZ 5","geleistete Wochenstunden","Restarbeitszeit Jahr","verbleibende AZ im Jahr in Prozent","Anmerkung / Hinweis / Begründung 6",{"$f":"Januar!Z3","v":"Plausibilitätsprüfung "}]
["JAHR-SOLL",null,{"$f":"Stammdaten!B34","v":0},null,{"$f":"Stammdaten!B35","v":0},null,{"$f":"Stammdaten!B36","v":0},null,{"$f":"Stammdaten!B37","v":0},null,{"$f":"Stammdaten!B38","v":0},null,{"$f":"Stammdaten!B39","v":0},null,{"$f":"Stammdaten!B26","v":1287},null,{"$f":"Stammdaten!B7","v":30},"Tag 3"," Umrechnung in Stunden",null,{"$f":"Stammdaten!B26","v":1287}]
["JAHR-IST",null,{"$f":"'2023'!B8","v":0},null,{"$f":"'2023'!C8","v":0},null,{"$f":"'2023'!D8","v":0},null,{"$f":"'2023'!E8","v":0},null,{"$f":"'2023'!F8","v":0},null,{"$f":"'2023'!G8","v":0},null,{"$f":"'2023'!H8","v":0},null,{"$f":"Mai!Q5-Juni!Q45","v":30},null,{"$f":"SUM(S6:S44)","v":0},null,{"$f":"U4-W44","v":0}]
[null,"Mo",null,null,null,null,null,null,null,null,null,null,null,null,null,null,null,null,{"$f":"IF(R6=INTERN!$A$4,$R$1,\"0\")","v":"0"},null,{"$f":"SUM(C6:O6)+S6","v":0},null,null,null,null,{"$f":"IF(OR(AND(OR(C6<>\"\",E6<>\"\",G6<>\"\",I6<>\"\",K6<>\"\",M6<>\"\",O6<>\"\"),Q6<>\"\"),AND(OR(C6<>\"\",E6<>\"\",G6<>\"\",I6<>\"\",K6<>\"\",M6<>\"\",O6<>\"\"),R6<>\"\"),AND(Q6<>\"\",R6<>\"\")),\"Fehler\",\"\")","v":""}]
[null,"Die",null,null,null,null,null,null,null,null,null,null,null,null,null,null,null,null,{"$f":"IF(R7=INTERN!$A$4,$R$1,\"0\")","v":"0"},null,{"$f":"SUM(C7:O7)+S7","v":0},null,null,null,null,{"$f":"IF(OR(AND(OR(C7<>\"\",E7<>\"\",G7<>\"\",I7<>\"\",K7<>\"\",M7<>\"\",O7<>\"\"),Q7<>\"\"),AND(OR(C7<>\"\",E7<>\"\",G7<>\"\",I7<>\"\",K7<>\"\",M7<>\"\",O7<>\"\"),R7<>\"\"),AND(Q7<>\"\",R7<>\"\")),\"Fehler\",\"\")","v":""}]
[null,"Mi",null,null,null,null,null,null,null,null,null,null,null,null,null,null,null,null,{"$f":"IF(R8=INTERN!$A$4,$R$1,\"0\")","v":"0"},null,0,null,null,null,null,""]
["1.6.","Do",null,null,null,null,null,null,null,null,null,null,null,null,null,null,null,null,{"$f":"IF(R9=INTERN!$A$4,$R$1,\"0\")","v":"0"},null,0,null,null,null,null,""]
["2.6.","Fr",null,null,null,null,null,null,null,null,null,null,null,null,null,null,null,null,{"$f":"R10*R1","v":0},null,0,null,null,null,null,""]
["3.6.","Sa",null,null,null,null,null,null,null,null,null,null,null,null,null,null,null,null,null,null,{"$f":"SUM(C11:O11)","v":0},null,null,null,null,""]
["4.6.","So",null,null,null,null,null,null,null,null,null,null,null,null,null,null,null,null,null,null,{"$f":"SUM(C12:O12)","v":0},{"$f":"SUM(U6:U12)","v":0},{"$f":"Mai!W44-Juni!V12","v":1287},{"$f":"(W12*100)/U1","v":100},null,""]
["5.6.","Mo",null,null,null,null,null,null,null,null,null,null,null,null,null,null,null,null,{"$f":"IF(R13=INTERN!$A$4,$R$1,\"0\")","v":"0"},null,0,null,null,null,null,""]
["6.6.","Die",null,null,null,null,null,null,null,null,null,null,null,null,null,null,null,null,{"$f":"IF(R14=INTERN!$A$4,$R$1,\"0\")","v":"0"},null,0,null,null,null,null,""]
["7.6.","Mi",null,null,null,null,null,null,null,null,null,null,null,null,null,null,null,null,{"$f":"IF(R15=INTERN!$A$4,$R$1,\"0\")","v":"0"},null,0,null,null,null,null,""]
["8.6.","Do",null,null,null,null,null,null,null,null,null,null,null,null,null,null,null,null,{"$f":"IF(R16=INTERN!$A$4,$R$1,\"0\")","v":"0"},null,0,null,null,null,null,""]
["9.6.","Fr",null,null,null,null,null,null,null,null,null,null,null,null,null,null,null,null,{"$f":"R17*R1","v":0},null,0,null,null,null,null,""]
["10.6.","Sa",null,null,null,null,null,null,null,null,null,null,null,null,null,null,null,null,null,null,{"$f":"SUM(C18:O18)","v":0},null,null,null,null,""]
["11.6.","So",null,null,null,null,null,null,null,null,null,null,null,null,null,null,null,null,null,null,{"$f":"SUM(C19:O19)","v":0},{"$f":"SUM(U13:U19)","v":0},{"$f":"W12-V19","v":1287},{"$f":"(W19*100)/U1","v":100},null,""]
["12.6.","Mo",null,null,null,null,null,null,null,null,null,null,null,null,null,null,null,null,{"$f":"IF(R20=INTERN!$A$4,$R$1,\"0\")","v":"0"},null,0," ",null,null,null,""]
["13.6.","Die",null,null,null,null,null,null,null,null,null,null,null,null,null,null,null,null,{"$f":"IF(R21=INTERN!$A$4,$R$1,\"0\")","v":"0"},null,0,null,null,null,null,""]
["14.6.","Mi",null,null,null,null,null,null,null,null,null,null,null,null,null,null,null,null,{"$f":"IF(R22=INTERN!$A$4,$R$1,\"0\")","v":"0"},null,0,null,null,null,null,""]
["15.6.","Do",null,null,null,null,null,null,null,null,null,null,null,null,null,null,null,null,{"$f":"IF(R23=INTERN!$A$4,$R$1,\"0\")","v":"0"},null,0,null,null,null,null,""]
["16.6.","Fr",null,null,null,null,null,null,null,null,null,null,null,null,null,null,null,null,{"$f":"R24*R1","v":0},null,0,null,null,null,null,""]
["17.6.","Sa",null,null,null,null,null,null,null,null,null,null,null,null,null,null,null,null,null,null,{"$f":"SUM(C25:O25)","v":0},null,null,null,null,""]
["18.6.","So",null,null,null,null,null,null,null,null,null,null,null,null,null,null,null,null,null,null,{"$f":"SUM(C26:O26)","v":0},{"$f":"SUM(U20:U26)","v":0},{"$f":"W19-V26","v":1287},{"$f":"(W26*100)/U1","v":100},null,""]
["19.6.","Mo",null,null,null,null,null,null,null,null,null,null,null,null,null,null,null,null,{"$f":"IF(R27=INTERN!$A$4,$R$1,\"0\")","v":"0"},null,0,null,null,null,null,""]
["20.6.","Die",null,null,null,null,null,null,null,null,null,null,null,null,null,null,null,null,{"$f":"IF(R28=INTERN!$A$4,$R$1,\"0\")","v":"0"},null,0,null,null,null,null,""]
["21.6.","Mi",null,null,null,null,null,null,null,null,null,null,null,null,null,null,null,null,{"$f":"IF(R29=INTERN!$A$4,$R$1,\"0\")","v":"0"},null,0,null,null,null,null,""]
["22.6.","Do",null,null,null,null,null,null,null,null,null,null,null,null,null,null,null,null,{"$f":"IF(R30=INTERN!$A$4,$R$1,\"0\")","v":"0"},null,0,null,null,null,null,""]
["23.6.","Fr",null,null,null,null,null,null,null,null,null,null,null,null,null,null,null,null,{"$f":"R31*R1","v":0},null,0,null,null,null,null,""]
["24.6.","Sa",null,null,null,null,null,null,null,null,null,null,null,null,null,null,null,null,null,null,{"$f":"SUM(C32:O32)","v":0},null,null,null,null,""]
["25.6.","So",null,null,null,null,null,null,null,null,null,null,null,null,null,null,null,null,null,null,{"$f":"SUM(C33:O33)","v":0},{"$f":"SUM(U27:U33)","v":0},{"$f":"W26-V33","v":1287},{"$f":"(W33*100)/U1","v":100},null,{"$f":"IF(OR(AND(OR(C33<>\"\",E33<>\"\",G33<>\"\",I33<>\"\",K33<>\"\",M33<>\"\",O33<>\"\"),Q33<>\"\"),AND(OR(C33<>\"\",E33<>\"\",G33<>\"\",I33<>\"\",K33<>\"\",M33<>\"\",O33<>\"\"),R33<>\"\"),AND(Q33<>\"\",R33<>\"\")),\"Fehler\",\"\")","v":""}]
["26.6.","Mo",null,null,null,null,null,null,null,null,null,null,null,null,null,null,null,null,{"$f":"IF(R34=INTERN!$A$4,$R$1,\"0\")","v":"0"},null,0,null,null,null,null,""]
["27.6.","Die",null,null,null,null,null,null,null,null,null,null,null,null,null,null,null,null,{"$f":"IF(R35=INTERN!$A$4,$R$1,\"0\")","v":"0"},null,0,null,null,null,null,""]
["28.6.","Mi",null,null,null,null,null,null,null,null,null,null,null,null,null,null,null,null,{"$f":"IF(R36=INTERN!$A$4,$R$1,\"0\")","v":"0"},null,0,null,null,null,null,""]
["29.6.","Do",null,null,null,null,null,null,null,null,null,null,null,null,null,null,null,null,{"$f":"IF(R37=INTERN!$A$4,$R$1,\"0\")","v":"0"},null,0,null,null,null,null,""]
["30.6.","Fr",null,null,null,null,null,null,null,null,null,null,null,null,null,null,null,null,{"$f":"R38*R1","v":0},null,0,null,null,null,null,""]
[null,"Sa",null,null,null,null,null,null,null,null,null,null,null,null,null,null,null,null,null,null,{"$f":"SUM(C39:O39)","v":0},null,null,null,null,""]
[null,"So",null,null,null,null,null,null,null,null,null,null,null,null,null,null,null,null,null,null,{"$f":"SUM(C40:O40)","v":0},{"$f":"SUM(U34:U40)","v":0},{"$f":"W33-V40","v":1287},{"$f":"(W40*100)/U1","v":100},null,""]
[null,"Mo",null,null,null,null,null,null,null,null,null,null,null,null,null,null,null,null,{"$f":"IF(R41=INTERN!$A$4,$R$1,\"0\")","v":"0"},null,0,null,null,null,null,""]
[null,"Di",null,null,null,null,null,null,null,null,null,null,null,null,null,null,null,null,{"$f":"IF(R42=INTERN!$A$4,$R$1,\"0\")","v":"0"},null,0,null,null,null,null,""]
[null,"Mi",null,null,null,null,null,null,null,null,null,null,null,null,null,null,null,null,{"$f":"IF(R43=INTERN!$A$4,$R$1,\"0\")","v":"0"},null,0,null,null,null,null,""]
[null,"Do",null,null,null,null,null,null,null,null,null,null,null,null,null,null,null,null,{"$f":"IF(R44=INTERN!$A$4,$R$1,\"0\")","v":"0"},null,0,{"$f":"SUM(U41:U44)","v":0},{"$f":"W40-V44","v":1287},{"$f":"(W44*100)/U1","v":100},null,""]
[null,null,"gesamt",{"$f":"SUM(C6:D44)","v":0},"gesamt",{"$f":"SUM(E6:F44)","v":0},"gesamt",{"$f":"SUM(G6:G44)","v":0},"gesamt",{"$f":"SUM(I6:J44)","v":0},"gesamt",{"$f":"SUM(K6:L44)","v":0},"gesamt",{"$f":"SUM(M6:N44)","v":0},"gesamt",{"$f":"SUM(O6:P44)","v":0},{"$f":"SUM(Q6:Q44)","v":0},null,{"$f":"SUM(S6:S44)","v":0},null,null,null,null,"AUSDRUCK-ÜBERSICHT\n (Hier klicken)"]
[]
["1 Spalte O/P: Die SpalteTagesarbeitszeit wird  im MODELL  A ausgefüllt. Dabei ist hier jeweils die Gesamtarbeitszeit pro Tag in einer Summe einzutragen. Eine  Aufteilung in einzelne Arbeitsbereiche wird nur im MODELL B vorgenommen (in Spalte C bis L). \nFür die Darstellung von MODELL A wird über der Spaltenbeschriftung im Kopf (M) auf das Minus geklickt. Überflüssige Spalten werden damit ausgeblendet. (Siehe auch Arbeitshilfe.) Für die Darstellung von MODELL B wird auf das Plus-Zeichen über Spalte O geklickt. "]
["2  Spalte Q: An Urlaubstagen ist immer die Zahl 1 (und nichts anderes) einzutragen. Zusätzlich ist darauf zu achten, dass an Urlaubstagen keine Arbeitszeit ausgefüllt wird. (Sonst würde der Widerspruch in der Tabelle dargestellt, dass an Urlaubstagen gearbeitet wird. Technisch lässt sich diese Fehldarstellung nicht ausschließen, sodass dieser Hinweis selber beachtet werden muss.) ACHTUNG: Weil an Wochendenen  keine Krankheits- und Urlaubstage eingetragen werden dürfen, sind diese Felder gesperrt. An gesetzlichen Feiertagen dürfen ebenfalls keine Urlaubstage eingetragen werden. \nMitarbeitende mit einer 6-Tage-Woche können Krankheits- und Urlaubstage jeweils freitags mit hinzuzählen. Alle anderen Wochentage sind jeweils nur für eine \"1\" freigegeben."]
["3 Spalte R/S: Je Krankheitstag oder/und personenbezogener Freistellung (Freistellung für Krankheit Kinder, Zusatzfreistellungstage z.B. für Kinder und Pflege) mit einer \"1\" angeben. Angerechnet wird zur Arbeitszeit die \"reguläre tägliche AZ im GP- oder Kirchenmusikalischen Dienst\" (Feld R1). ACHTUNG: Weil an Wochendenen  keine Krankheits- und Urlaubstagstage eingetragen werden dürfen, sind diese Felder gesperrt. An gesetzlichen Feiertagen dürfen ebenfalls keine Krankheitstage eingetragen werden. \nMitarbeitende mit einer 6-Tage-Woche können Krankheitstage jeweils freitags mit hinzuzählen (statt eine 1 eine 2 eintragen). Alle anderen Wochentage sind jeweils nur für eine \"1\" freigegeben."]
["4 Spalte T: Hier werden die Arbeitsorte des jeweiligen Tages eingetragen. Wegen der  begrenzten Spaltengröße empfiehlt es sich, eigene Kürzel festzulegen."]
["5 Spalte U, Zeile 4 und 5: JAHR-SOLL entspricht der Jahresplanung; JAHR-IST enthält die tagesaktuelle, schon geleistete AZ in diesem Bereich. "]
["6 Spalte Y: Platz für Anmerkungen.  ACHTUNG: Die Schrift passt sich der Größe des Feldes an. Bei viel Text wird die Schrift sehr klein. Im Bedarfsfall kann im Eingabefeld der Text angeschaut werden. Diese Form ist notwendig, um einen Ausdruck zu ermöglichen."]

{"sheet":"Juli","index":10,"n_rows":57,"n_cols":26,"rows_kept":57,"cut":false,"hidden":false,"merged":[[24,16,25,18],[31,16,32,18],[38,16,39,18],[55,0,55,24],[43,8,43,9],[43,10,43,11],[43,12,43,13],[41,14,41,15],[42,14,42,15],[40,14,40,15],[40,21,42,21],[40,22,42,22],[40,23,42,23],[41,2,41,3],[41,4,41,5],[41,6,41,7],[41,8,41,9],[41,10,41,11],[42,2,42,3],[42,4,42,5],[42,6,42,7],[42,8,42,9],[42,10,42,11],[42,12,42,13],[56,0,56,24],[43,14,43,15],[44,19,44,24],[51,0,51,24],[52,0,52,24],[53,0,53,24],[54,0,54,24],[43,2,43,3],[43,4,43,5],[43,6,43,7],[49,22,49,24],[50,22,50,24],[40,10,40,11],[40,12,40,13],[39,10,39,11],[39,12,39,13],[38,2,38,3],[38,4,38,5],[40,2,40,3],[40,4,40,5],[40,6,40,7],[40,8,40,9],[39,2,39,3],[39,4,39,5],[39,6,39,7],[39,8,39,9],[38,6,38,7],[38,8,38,9],[34,2,34,3],[34,4,34,5],[34,6,34,7],[34,8,34,9],[34,10,34,11],[41,12,41,13],[33,14,33,15],[37,2,37,3],[37,4,37,5],[37,6,37,7],[37,8,37,9],[36,2,36,3],[36,4,36,5],[36,6,36,7],[33,4,33,5],[33,6,33,7],[33,8,33,9],[34,12,34,13],[33,2,33,3],[35,2,35,3],[35,4,35,5],[35,6,35,7],[36,8,36,9],[39,14,39,15],[33,10,33,11],[33,12,33,13],[33,22,38,22],[35,12,35,13],[36,10,36,11],[36,12,36,13],[33,21,38,21],[38,12,38,13],[35,8,35,9],[34,14,34,15],[35,14,35,15],[37,10,37,11],[37,12,37,13],[36,14,36,15],[37,14,37,15],[38,14,38,15],[38,10,38,11],[35,10,35,11],[32,14,32,15],[31,2,31,3],[31,4,31,5],[31,6,31,7],[31,8,31,9],[31,10,31,11],[31,12,31,13],[32,2,32,3],[32,4,32,5],[32,6,32,7],[32,8,32,9],[32,10,32,11],[32,12,32,13],[29,14,29,15],[30,14,30,15],[31,14,31,15],[29,8,29,9],[29,10,29,11],[29,12,29,13],[30,12,30,13],[30,2,30,3],[30,4,30,5],[30,6,30,7],[29,2,29,3],[29,4,29,5],[29,6,29,7],[26,2,26,3],[26,4,26,5],[26,6,26,7],[26,8,26,9],[26,10,26,11],[26,12,26,13],[26,14,26,15],[26,23,31,23],[27,14,27,15],[28,14,28,15],[30,8,30,9],[30,10,30,11],[28,12,28,13],[26,21,31,21],[26,22,31,22],[27,12,27,13],[27,2,27,3],[27,4,27,5],[27,6,27,7],[27,8,27,9],[27,10,27,11],[28,8,28,9],[28,10,28,11],[28,2,28,3],[28,4,28,5],[28,6,28,7],[24,12,24,13],[22,14,22,15],[23,14,23,15],[24,14,24,15],[22,8,22,9],[22,10,22,11],[22,12,22,13],[25,14,25,15],[25,2,25,3],[25,4,25,5],[25,6,25,7],[25,8,25,9],[25,10,25,11],[25,12,25,13],[22,6,22,7],[24,6,24,7],[24,8,24,9],[24,10,24,11],[24,2,24,3],[24,4,24,5],[23,2,23,3],[23,4,23,5],[23,6,23,7],[22,2,22,3],[22,4,22,5],[19,2,19,3],[19,4,19,5],[19,6,19,7],[19,8,19,9],[19,10,19,11],[19,12,19,13],[19,14,19,15],[23,8,23,9],[23,10,23,11],[20,2,20,3],[20,4,20,5],[20,6,20,7],[20,8,20,9],[20,10,20,11],[21,8,21,9],[21,10,21,11],[21,2,21,3],[21,12,21,13],[20,12,20,13],[23,12,23,13],[20,14,20,15],[21,14,21,15],[21,4,21,5],[21,6,21,7],[18,12,18,13],[15,4,15,5],[15,6,15,7],[18,14,18,15],[17,2,17,3],[17,4,17,5],[17,6,17,7],[17,8,17,9],[17,10,17,11],[17,12,17,13],[15,14,15,15],[16,14,16,15],[17,14,17,15],[15,8,15,9],[15,12,15,13],[14,4,14,5],[14,6,14,7],[16,4,16,5],[16,6,16,7],[15,10,15,11],[18,2,18,3],[18,4,18,5],[18,6,18,7],[18,8,18,9],[18,10,18,11],[17,16,18,18],[16,8,16,9],[16,10,16,11],[13,12,13,13],[16,12,16,13],[13,14,13,15],[14,14,14,15],[14,12,14,13],[11,2,11,3],[11,4,11,5],[11,6,11,7],[11,8,11,9],[11,10,11,11],[11,12,11,13],[13,2,13,3],[13,4,13,5],[13,6,13,7],[13,8,13,9],[13,10,13,11],[14,8,14,9],[14,10,14,11],[14,2,14,3],[16,2,16,3],[15,2,15,3],[10,14,10,15],[11,14,11,15],[12,2,12,3],[12,4,12,5],[12,6,12,7],[12,8,12,9],[12,10,12,11],[12,12,12,13],[12,14,12,15],[8,12,8,13],[10,12,10,13],[8,8,8,9],[8,10,8,11],[8,14,8,15],[9,14,9,15],[6,2,6,3],[10,6,10,7],[10,8,10,9],[10,10,10,11],[9,10,9,11],[9,12,9,13],[10,2,10,3],[10,4,10,5],[8,4,8,5],[8,6,8,7],[6,12,6,13],[6,14,6,15],[9,2,9,3],[9,4,9,5],[9,6,9,7],[9,8,9,9],[7,2,7,3],[7,14,7,15],[8,2,8,3],[7,10,7,11],[7,12,7,13],[7,4,7,5],[10,16,11,18],[5,14,5,15],[4,0,4,1],[4,2,4,3],[4,4,4,5],[4,6,4,7],[4,8,4,9],[4,10,4,11],[7,6,7,7],[7,8,7,9],[4,12,4,13],[4,14,4,15],[5,2,5,3],[5,4,5,5],[5,6,5,7],[5,8,5,9],[5,10,5,11],[5,12,5,13],[6,4,6,5],[6,6,6,7],[6,8,6,9],[6,10,6,11],[3,0,3,1],[3,2,3,3],[3,4,3,5],[3,6,3,7],[3,8,3,9],[3,10,3,11],[3,12,3,13],[3,14,3,15],[2,2,2,3],[0,0,0,11],[0,14,0,16],[0,17,0,18],[1,0,1,13],[2,4,2,5],[2,6,2,7],[2,8,2,9],[2,10,2,11],[2,12,2,13],[2,17,2,18],[0,21,0,25],[1,21,1,25],[45,20,45,24],[46,22,46,24],[47,22,47,24],[48,22,48,24],[12,23,17,23],[19,23,24,23],[5,23,10,23],[19,21,24,21],[19,22,24,22],[5,21,10,21],[5,22,10,22],[12,21,17,21],[12,22,17,22],[33,23,38,23]]}
[{"$f":"Stammdaten!B3","v":0},null,null,null,null,null,null,null,null,null,null,null,null,null,{"$f":"Januar!O1","v":"reguläre tägliche AZ im GP-Dienst/ Kirchenmusik (Stunden)"},null,null,{"$f":"Stammdaten!B31","v":5.85},null,{"$f":"Januar!T1","v":"SOLL-AZ  im GP/KM-Dienst (Stunden)"},{"$f":"Stammdaten!B26","v":1287},"JULI"]
[null,null,null,null,null,null,null,null,null,null,null,null,null,null,"a)  Angaben in Stunden (Bsp. 1,00=60min; 1,5=90min; 0,75=45min; 0,25=15min)",null,null,null,null,null,null,{"$f":"Januar!V2","v":"b)  Die Felder in dieser Farbe werden automatisch ausgefüllt."}]
[null,"Tag",{"$f":"'2023'!B6","v":"1) Regelmäßige Veranstaltungen "},null,{"$f":"'2023'!C6","v":"2) Einzelveranstaltungen, Projekte, Freizeiten, besondere Dienste "},null,{"$f":"'2023'!D6","v":"3) Gremien, Konvente"},null,{"$f":"'2023'!E6","v":"4) Sonstige Dienstpflichten "},null,{"$f":"'2023'!F6","v":"5) Entwicklung neuer Arbeitsansätze / Unvorhersehbares / seelsorgerische Begleitung Einzelner"},null,{"$f":"'2023'!G6","v":"6) sonstige Arbeitsfelder (z.B. Kirchenmusik) "},null,{"$f":"'2023'!H6","v":"Tagesarbeitszeit"},"siehe 1","Urlaub - Tag je als 1 eintragen 2","Krankheit und weitere personenbezogene  Freistellungen - Tag je als \"1\" eintragen 3",null,"Ort 4","geleistete AZ 5","geleistete Wochenstunden","Restarbeitszeit Jahr","verbleibende AZ im Jahr in Prozent","Anmerkung / Hinweis / Begründung 6",{"$f":"Januar!Z3","v":"Plausibilitätsprüfung "}]
["JAHR-SOLL",null,{"$f":"Stammdaten!B34","v":0},null,{"$f":"Stammdaten!B35","v":0},null,{"$f":"Stammdaten!B36","v":0},null,{"$f":"Stammdaten!B37","v":0},null,{"$f":"Stammdaten!B38","v":0},null,{"$f":"Stammdaten!B39","v":0},null,{"$f":"Stammdaten!B26","v":1287},null,{"$f":"Stammdaten!B7","v":30},"Tag 3"," Umrechnung in Stunden",null,{"$f":"Stammdaten!B26","v":1287}]
["JAHR-IST",null,{"$f":"'2023'!B8","v":0},null,{"$f":"'2023'!C8","v":0},null,{"$f":"'2023'!D8","v":0},null,{"$f":"'2023'!E8","v":0},null,{"$f":"'2023'!F8","v":0},null,{"$f":"'2023'!G8","v":0},null,{"$f":"'2023'!H8","v":0},null,{"$f":"Juni!Q5-Juli!Q45","v":30},null,{"$f":"SUM(S6:S44)","v":0},null,{"$f":"U4-W44","v":0}]
[null,"Mo",null,null,null,null,null,null,null,null,null,null,null,null,null,null,null,null,{"$f":"IF(R6=INTERN!$A$4,$R$1,\"0\")","v":"0"},null,{"$f":"SUM(C6:O6)+S6","v":0},null,null,null,null,{"$f":"IF(OR(AND(OR(C6<>\"\",E6<>\"\",G6<>\"\",I6<>\"\",K6<>\"\",M6<>\"\",O6<>\"\"),Q6<>\"\"),AND(OR(C6<>\"\",E6<>\"\",G6<>\"\",I6<>\"\",K6<>\"\",M6<>\"\",O6<>\"\"),R6<>\"\"),AND(Q6<>\"\",R6<>\"\")),\"Fehler\",\"\")","v":""}]
[null,"Die",null,null,null,null,null,null,null,null,null,null,null,null,null,null,null,null,{"$f":"IF(R7=INTERN!$A$4,$R$1,\"0\")","v":"0"},null,{"$f":"SUM(C7:O7)+S7","v":0},null,null,null,null,{"$f":"IF(OR(AND(OR(C7<>\"\",E7<>\"\",G7<>\"\",I7<>\"\",K7<>\"\",M7<>\"\",O7<>\"\"),Q7<>\"\"),AND(OR(C7<>\"\",E7<>\"\",G7<>\"\",I7<>\"\",K7<>\"\",M7<>\"\",O7<>\"\"),R7<>\"\"),AND(Q7<>\"\",R7<>\"\")),\"Fehler\",\"\")","v":""}]
[null,"Mi",null,null,null,null,null,null,null,null,null,null,null,null,null,null,null,null,{"$f":"IF(R8=INTERN!$A$4,$R$1,\"0\")","v":"0"},null,0,null,null,null,null,""]
[null,"Do",null,null,null,null,null,null,null,null,null,null,null,null,null,null,null,null,{"$f":"IF(R9=INTERN!$A$4,$R$1,\"0\")","v":"0"},null,0,null,null,null,null,""]
[null,"Fr",null,null,null,null,null,null,null,null,null,null,null,null,null,null,null,null,{"$f":"R10*R1","v":0},null,0,null,null,null,null,""]
["1.7.","Sa",null,null,null,null,null,null,null,null,null,null,null,null,null,null,null,null,null,null,{"$f":"SUM(C11:O11)","v":0},null,null,null,null,""]
["2.7.","So",null,null,null,null,null,null,null,null,null,null,null,null,null,null,null,null,null,null,{"$f":"SUM(C12:O12)","v":0},{"$f":"SUM(U6:U12)","v":0},{"$f":"Juni!W44-Juli!V12","v":1287},{"$f":"(W12*100)/U1","v":100},null,""]
["3.7.","Mo",null,null,null,null,null,null,null,null,null,null,null,null,null,null,null,null,{"$f":"IF(R13=INTERN!$A$4,$R$1,\"0\")","v":"0"},null,0,null,null,null,null,""]
["4.7.","Die",null,null,null,null,null,null,null,null,null,null,null,null,null,null,null,null,{"$f":"IF(R14=INTERN!$A$4,$R$1,\"0\")","v":"0"},null,0,null,null,null,null,""]
["5.7.","Mi",null,null,null,null,null,null,null,null,null,null,null,null,null,null,null,null,{"$f":"IF(R15=INTERN!$A$4,$R$1,\"0\")","v":"0"},null,0,null,null,null,null,""]
["6.7.","Do",null,null,null,null,null,null,null,null,null,null,null,null,null,null,null,null,{"$f":"IF(R16=INTERN!$A$4,$R$1,\"0\")","v":"0"},null,0,null,null,null,null,""]
["7.7.","Fr",null,null,null,null,null,null,null,null,null,null,null,null,null,null,null,null,{"$f":"R17*R1","v":0},null,0,null,null,null,null,""]
["8.7.","Sa",null,null,null,null,null,null,null,null,null,null,null,null,null,null,null,null,null,null,{"$f":"SUM(C18:O18)","v":0},null,null,null,null,""]
["9.7.","So",null,null,null,null,null,null,null,null,null,null,null,null,null,null,null,null,null,null,{"$f":"SUM(C19:O19)","v":0},{"$f":"SUM(U13:U19)","v":0},{"$f":"W12-V19","v":1287},{"$f":"(W19*100)/U1","v":100},null,""]
["10.7.","Mo",null,null,null,null,null,null,null,null,null,null,null,null,null,null,null,null,{"$f":"IF(R20=INTERN!$A$4,$R$1,\"0\")","v":"0"},null,0," ",null,null,null,""]
["11.7.","Die",null,null,null,null,null,null,null,null,null,null,null,null,null,null,null,null,{"$f":"IF(R21=INTERN!$A$4,$R$1,\"0\")","v":"0"},null,0,null,null,null,null,""]
["12.7.","Mi",null,null,null,null,null,null,null,null,null,null,null,null,null,null,null,null,{"$f":"IF(R22=INTERN!$A$4,$R$1,\"0\")","v":"0"},null,0,null,null,null,null,""]
["13.7.","Do",null,null,null,null,null,null,null,null,null,null,null,null,null,null,null,null,{"$f":"IF(R23=INTERN!$A$4,$R$1,\"0\")","v":"0"},null,0,null,null,null,null,""]
["14.7.","Fr",null,null,null,null,null,null,null,null,null,null,null,null,null,null,null,null,{"$f":"R24*R1","v":0},null,0,null,null,null,null,""]
["15.7.","Sa",null,null,null,null,null,null,null,null,null,null,null,null,null,null,null,null,null,null,{"$f":"SUM(C25:O25)","v":0},null,null,null,null,""]
["16.7.","So",null,null,null,null,null,null,null,null,null,null,null,null,null,null,null,null,null,null,{"$f":"SUM(C26:O26)","v":0},{"$f":"SUM(U20:U26)","v":0},{"$f":"W19-V26","v":1287},{"$f":"(W26*100)/U1","v":100},null,""]
["17.7.","Mo",null,null,null,null,null,null,null,null,null,null,null,null,null,null,null,null,{"$f":"IF(R27=INTERN!$A$4,$R$1,\"0\")","v":"0"},null,0,null,null,null,null,""]
["18.7.","Die",null,null,null,null,null,null,null,null,null,null,null,null,null,null,null,null,{"$f":"IF(R28=INTERN!$A$4,$R$1,\"0\")","v":"0"},null,0,null,null,null,null,""]
["19.7.","Mi",null,null,null,null,null,null,null,null,null,null,null,null,null,null,null,null,{"$f":"IF(R29=INTERN!$A$4,$R$1,\"0\")","v":"0"},null,0,null,null,null,null,""]
["20.7.","Do",null,null,null,null,null,null,null,null,null,null,null,null,null,null,null,null,{"$f":"IF(R30=INTERN!$A$4,$R$1,\"0\")","v":"0"},null,0,null,null,null,null,""]
["21.7.","Fr",null,null,null,null,null,null,null,null,null,null,null,null,null,null,null,null,{"$f":"R31*R1","v":0},null,0,null,null,null,null,""]
["22.7.","Sa",null,null,null,null,null,null,null,null,null,null,null,null,null,null,null,null,null,null,{"$f":"SUM(C32:O32)","v":0},null,null,null,null,""]
["23.7.","So",null,null,null,null,null,null,null,null,null,null,null,null,null,null,null,null,null,null,{"$f":"SUM(C33:O33)","v":0},{"$f":"SUM(U27:U33)","v":0},{"$f":"W26-V33","v":1287},{"$f":"(W33*100)/U1","v":100},null,{"$f":"IF(OR(AND(OR(C33<>\"\",E33<>\"\",G33<>\"\",I33<>\"\",K33<>\"\",M33<>\"\",O33<>\"\"),Q33<>\"\"),AND(OR(C33<>\"\",E33<>\"\",G33<>\"\",I33<>\"\",K33<>\"\",M33<>\"\",O33<>\"\"),R33<>\"\"),AND(Q33<>\"\",R33<>\"\")),\"Fehler\",\"\")","v":""}]
["24.7.","Mo",null,null,null,null,null,null,null,null,null,null,null,null,null,null,null,null,{"$f":"IF(R34=INTERN!$A$4,$R$1,\"0\")","v":"0"},null,0,null,null,null,null,""]
["25.7.","Die",null,null,null,null,null,null,null,null,null,null,null,null,null,null,null,null,{"$f":"IF(R35=INTERN!$A$4,$R$1,\"0\")","v":"0"},null,0,null,null,null,null,""]
["26.7.","Mi",null,null,null,null,null,null,null,null,null,null,null,null,null,null,null,null,{"$f":"IF(R36=INTERN!$A$4,$R$1,\"0\")","v":"0"},null,0,null,null,null,null,""]
["27.7.","Do",null,null,null,null,null,null,null,null,null,null,null,null,null,null,null,null,{"$f":"IF(R37=INTERN!$A$4,$R$1,\"0\")","v":"0"},null,0,null,null,null,null,""]
["28.7.","Fr",null,null,null,null,null,null,null,null,null,null,null,null,null,null,null,null,{"$f":"R38*R1","v":0},null,0,null,null,null,null,""]
["29.7.","Sa",null,null,null,null,null,null,null,null,null,null,null,null,null,null,null,null,null,null,{"$f":"SUM(C39:O39)","v":0},null,null,null,null,""]
["30.7.","So",null,null,null,null,null,null,null,null,null,null,null,null,null,null,null,null,null,null,{"$f":"SUM(C40:O40)","v":0},{"$f":"SUM(U34:U40)","v":0},{"$f":"W33-V40","v":1287},{"$f":"(W40*100)/U1","v":100},null,""]
["31.7.","Mo",null,null,null,null,null,null,null,null,null,null,null,null,null,null,null,null,{"$f":"IF(R41=INTERN!$A$4,$R$1,\"0\")","v":"0"},null,0,null,null,null,null,""]
[null,"Di",null,null,null,null,null,null,null,null,null,null,null,null,null,null,null,null,{"$f":"IF(R42=INTERN!$A$4,$R$1,\"0\")","v":"0"},null,0,null,null,null,null,""]
[null,"Mi",null,null,null,null,null,null,null,null,null,null,null,null,null,null,null,null,{"$f":"IF(R43=INTERN!$A$4,$R$1,\"0\")","v":"0"},null,0,null,null,null,null,""]
[null,"Do",null,null,null,null,null,null,null,null,null,null,null,null,null,null,null,null,{"$f":"IF(R44=INTERN!$A$4,$R$1,\"0\")","v":"0"},null,0,{"$f":"SUM(U41:U44)","v":0},{"$f":"W40-V44","v":1287},{"$f":"(W44*100)/U1","v":100},null,""]
[null,null,"gesamt",{"$f":"SUM(C6:D44)","v":0},"gesamt",{"$f":"SUM(E6:F44)","v":0},"gesamt",{"$f":"SUM(G6:G44)","v":0},"gesamt",{"$f":"SUM(I6:J44)","v":0},"gesamt",{"$f":"SUM(K6:L44)","v":0},"gesamt",{"$f":"SUM(M6:N44)","v":0},"gesamt",{"$f":"SUM(O6:P44)","v":0},{"$f":"SUM(Q6:Q44)","v":0},null,{"$f":"SUM(S6:S44)","v":0},"AUSDRUCK-ÜBERSICHT"]
[null,null,null,null,null,null,null,null,null,null,null,null,null,null,null,null,null,null,null,null,"Übersicht über den Arbeitsstundenstand  \"Arbeitsfeld I und II\" laufender Monat"]
[null,null,null,null,null,null,null,null,null,null,null,null,null,null,null,null,null,null,null,null,{"$f":"U4","v":1287},"Stunden","SOLL-Jahresarbeitszeit"]
[null,null,null,null,null,null,null,null,null,null,null,null,null,null,null,null,null,null,null,null,{"$f":"U47-U49","v":0},"Stunden","bereits geleistete AZ am Ende des laufenden Monats "]
[null,null,null,null,null,null,null,null,null,null,null,null,null,null,null,null,null,null,null,null,{"$f":"W44","v":1287},"Stunden","noch zu leistende AZ nach Ende des laufenden Monats (Restjahresarbeitszeit)"]
[null,null,null,null,null,null,null,null,null,null,null,null,null,null,null,null,null,null,null,null,{"$f":"U49/5","v":257.39999999999998},"Stunden","Durchschnittliche monatliche Arbeitszeit August-Dezember, um Ende des Jahres ein ausgeglichenes Jahrsarbeitszeitkonto vorzuweisen. "]
[null,null,null,null,null,null,null,null,null,null,null,null,null,null,null,null,null,null,null,null,{"$f":"Juni!U5/6","v":0},"Stunden","Durchschnittliche bisherige monatliche Arbeitszeit zum Ende des Vormonats."]
["1 Spalte O/P: Die SpalteTagesarbeitszeit wird  im MODELL  A ausgefüllt. Dabei ist hier jeweils die Gesamtarbeitszeit pro Tag in einer Summe einzutragen. Eine  Aufteilung in einzelne Arbeitsbereiche wird nur im MODELL B vorgenommen (in Spalte C bis L). \nFür die Darstellung von MODELL A wird über der Spaltenbeschriftung im Kopf (M) auf das Minus geklickt. Überflüssige Spalten werden damit ausgeblendet. (Siehe auch Arbeitshilfe.) Für die Darstellung von MODELL B wird auf das Plus-Zeichen über Spalte O geklickt. "]
["2  Spalte Q: An Urlaubstagen ist immer die Zahl 1 (und nichts anderes) einzutragen. Zusätzlich ist darauf zu achten, dass an Urlaubstagen keine Arbeitszeit ausgefüllt wird. (Sonst würde der Widerspruch in der Tabelle dargestellt, dass an Urlaubstagen gearbeitet wird. Technisch lässt sich diese Fehldarstellung nicht ausschließen, sodass dieser Hinweis selber beachtet werden muss.) ACHTUNG: Weil an Wochendenen  keine Krankheits- und Urlaubstage eingetragen werden dürfen, sind diese Felder gesperrt. An gesetzlichen Feiertagen dürfen ebenfalls keine Urlaubstage eingetragen werden. \nMitarbeitende mit einer 6-Tage-Woche können Krankheits- und Urlaubstage jeweils freitags mit hinzuzählen. Alle anderen Wochentage sind jeweils nur für eine \"1\" freigegeben."]
["3 Spalte R/S: Je Krankheitstag oder/und personenbezogener Freistellung (Freistellung für Krankheit Kinder, Zusatzfreistellungstage z.B. für Kinder und Pflege) mit einer \"1\" angeben. Angerechnet wird zur Arbeitszeit die \"reguläre tägliche AZ im GP- oder Kirchenmusikalischen Dienst\" (Feld R1). ACHTUNG: Weil an Wochendenen  keine Krankheits- und Urlaubstagstage eingetragen werden dürfen, sind diese Felder gesperrt. An gesetzlichen Feiertagen dürfen ebenfalls keine Krankheitstage eingetragen werden. \nMitarbeitende mit einer 6-Tage-Woche können Krankheitstage jeweils freitags mit hinzuzählen (statt eine 1 eine 2 eintragen). Alle anderen Wochentage sind jeweils nur für eine \"1\" freigegeben."]
["4 Spalte T: Hier werden die Arbeitsorte des jeweiligen Tages eingetragen. Wegen der  begrenzten Spaltengröße empfiehlt es sich, eigene Kürzel festzulegen."]
["5 Spalte U, Zeile 4 und 5: JAHR-SOLL entspricht der Jahresplanung; JAHR-IST enthält die tagesaktuelle, schon geleistete AZ in diesem Bereich. "]
["6 Spalte Y: Platz für Anmerkungen.  ACHTUNG: Die Schrift passt sich der Größe des Feldes an. Bei viel Text wird die Schrift sehr klein. Im Bedarfsfall kann im Eingabefeld der Text angeschaut werden. Diese Form ist notwendig, um einen Ausdruck zu ermöglichen."]

{"sheet":"August","index":11,"n_rows":57,"n_cols":26,"rows_kept":57,"cut":false,"hidden":false,"merged":[[24,16,25,18],[31,16,32,18],[38,16,39,18],[55,0,55,24],[43,8,43,9],[43,10,43,11],[43,12,43,13],[41,14,41,15],[42,14,42,15],[40,14,40,15],[40,21,42,21],[40,22,42,22],[40,23,42,23],[41,2,41,3],[41,4,41,5],[41,6,41,7],[41,8,41,9],[41,10,41,11],[42,2,42,3],[42,4,42,5],[42,6,42,7],[42,8,42,9],[42,10,42,11],[42,12,42,13],[56,0,56,24],[43,14,43,15],[44,19,44,24],[51,0,51,24],[52,0,52,24],[53,0,53,24],[54,0,54,24],[43,2,43,3],[43,4,43,5],[43,6,43,7],[49,22,49,24],[50,22,50,24],[40,10,40,11],[40,12,40,13],[39,10,39,11],[39,12,39,13],[38,2,38,3],[38,4,38,5],[40,2,40,3],[40,4,40,5],[40,6,40,7],[40,8,40,9],[39,2,39,3],[39,4,39,5],[39,6,39,7],[39,8,39,9],[38,6,38,7],[38,8,38,9],[34,2,34,3],[34,4,34,5],[34,6,34,7],[34,8,34,9],[34,10,34,11],[41,12,41,13],[33,14,33,15],[37,2,37,3],[37,4,37,5],[37,6,37,7],[37,8,37,9],[36,2,36,3],[36,4,36,5],[36,6,36,7],[33,4,33,5],[33,6,33,7],[33,8,33,9],[34,12,34,13],[33,2,33,3],[35,2,35,3],[35,4,35,5],[35,6,35,7],[36,8,36,9],[39,14,39,15],[33,10,33,11],[33,12,33,13],[33,22,38,22],[35,12,35,13],[36,10,36,11],[36,12,36,13],[33,21,38,21],[38,12,38,13],[35,8,35,9],[34,14,34,15],[35,14,35,15],[37,10,37,11],[37,12,37,13],[36,14,36,15],[37,14,37,15],[38,14,38,15],[38,10,38,11],[35,10,35,11],[32,14,32,15],[31,2,31,3],[31,4,31,5],[31,6,31,7],[31,8,31,9],[31,10,31,11],[31,12,31,13],[32,2,32,3],[32,4,32,5],[32,6,32,7],[32,8,32,9],[32,10,32,11],[32,12,32,13],[29,14,29,15],[30,14,30,15],[31,14,31,15],[29,8,29,9],[29,10,29,11],[29,12,29,13],[30,12,30,13],[30,2,30,3],[30,4,30,5],[30,6,30,7],[29,2,29,3],[29,4,29,5],[29,6,29,7],[26,2,26,3],[26,4,26,5],[26,6,26,7],[26,8,26,9],[26,10,26,11],[26,12,26,13],[26,14,26,15],[26,23,31,23],[27,14,27,15],[28,14,28,15],[30,8,30,9],[30,10,30,11],[28,12,28,13],[26,21,31,21],[26,22,31,22],[27,12,27,13],[27,2,27,3],[27,4,27,5],[27,6,27,7],[27,8,27,9],[27,10,27,11],[28,8,28,9],[28,10,28,11],[28,2,28,3],[28,4,28,5],[28,6,28,7],[24,12,24,13],[22,14,22,15],[23,14,23,15],[24,14,24,15],[22,8,22,9],[22,10,22,11],[22,12,22,13],[25,14,25,15],[25,2,25,3],[25,4,25,5],[25,6,25,7],[25,8,25,9],[25,10,25,11],[25,12,25,13],[22,6,22,7],[24,6,24,7],[24,8,24,9],[24,10,24,11],[24,2,24,3],[24,4,24,5],[23,2,23,3],[23,4,23,5],[23,6,23,7],[22,2,22,3],[22,4,22,5],[19,2,19,3],[19,4,19,5],[19,6,19,7],[19,8,19,9],[19,10,19,11],[19,12,19,13],[19,14,19,15],[23,8,23,9],[23,10,23,11],[20,2,20,3],[20,4,20,5],[20,6,20,7],[20,8,20,9],[20,10,20,11],[21,8,21,9],[21,10,21,11],[21,2,21,3],[21,12,21,13],[20,12,20,13],[23,12,23,13],[20,14,20,15],[21,14,21,15],[21,4,21,5],[21,6,21,7],[18,12,18,13],[15,4,15,5],[15,6,15,7],[18,14,18,15],[17,2,17,3],[17,4,17,5],[17,6,17,7],[17,8,17,9],[17,10,17,11],[17,12,17,13],[15,14,15,15],[16,14,16,15],[17,14,17,15],[15,8,15,9],[15,12,15,13],[14,4,14,5],[14,6,14,7],[16,4,16,5],[16,6,16,7],[15,10,15,11],[18,2,18,3],[18,4,18,5],[18,6,18,7],[18,8,18,9],[18,10,18,11],[17,16,18,18],[16,8,16,9],[16,10,16,11],[13,12,13,13],[16,12,16,13],[13,14,13,15],[14,14,14,15],[14,12,14,13],[11,2,11,3],[11,4,11,5],[11,6,11,7],[11,8,11,9],[11,10,11,11],[11,12,11,13],[13,2,13,3],[13,4,13,5],[13,6,13,7],[13,8,13,9],[13,10,13,11],[14,8,14,9],[14,10,14,11],[14,2,14,3],[16,2,16,3],[15,2,15,3],[10,14,10,15],[11,14,11,15],[12,2,12,3],[12,4,12,5],[12,6,12,7],[12,8,12,9],[12,10,12,11],[12,12,12,13],[12,14,12,15],[8,12,8,13],[10,12,10,13],[8,8,8,9],[8,10,8,11],[8,14,8,15],[9,14,9,15],[6,2,6,3],[10,6,10,7],[10,8,10,9],[10,10,10,11],[9,10,9,11],[9,12,9,13],[10,2,10,3],[10,4,10,5],[8,4,8,5],[8,6,8,7],[6,12,6,13],[6,14,6,15],[9,2,9,3],[9,4,9,5],[9,6,9,7],[9,8,9,9],[7,2,7,3],[7,14,7,15],[8,2,8,3],[7,10,7,11],[7,12,7,13],[7,4,7,5],[10,16,11,18],[5,14,5,15],[4,0,4,1],[4,2,4,3],[4,4,4,5],[4,6,4,7],[4,8,4,9],[4,10,4,11],[7,6,7,7],[7,8,7,9],[4,12,4,13],[4,14,4,15],[5,2,5,3],[5,4,5,5],[5,6,5,7],[5,8,5,9],[5,10,5,11],[5,12,5,13],[6,4,6,5],[6,6,6,7],[6,8,6,9],[6,10,6,11],[3,0,3,1],[3,2,3,3],[3,4,3,5],[3,6,3,7],[3,8,3,9],[3,10,3,11],[3,12,3,13],[3,14,3,15],[2,2,2,3],[0,0,0,11],[0,14,0,16],[0,17,0,18],[1,0,1,13],[2,4,2,5],[2,6,2,7],[2,8,2,9],[2,10,2,11],[2,12,2,13],[2,17,2,18],[0,21,0,25],[1,21,1,25],[45,20,45,24],[46,22,46,24],[47,22,47,24],[48,22,48,24],[12,23,17,23],[19,23,24,23],[5,23,10,23],[19,21,24,21],[19,22,24,22],[5,21,10,21],[5,22,10,22],[12,21,17,21],[12,22,17,22],[33,23,38,23]]}
[{"$f":"Stammdaten!B3","v":0},null,null,null,null,null,null,null,null,null,null,null,null,null,{"$f":"Januar!O1","v":"reguläre tägliche AZ im GP-Dienst/ Kirchenmusik (Stunden)"},null,null,{"$f":"Stammdaten!B31","v":5.85},null,{"$f":"Januar!T1","v":"SOLL-AZ  im GP/KM-Dienst (Stunden)"},{"$f":"Stammdaten!B26","v":1287},"AUGUST"]
[null,null,null,null,null,null,null,null,null,null,null,null,null,null,"a)  Angaben in Stunden (Bsp. 1,00=60min; 1,5=90min; 0,75=45min; 0,25=15min)",null,null,null,null,null,null,{"$f":"Januar!V2","v":"b)  Die Felder in dieser Farbe werden automatisch ausgefüllt."}]
[null,"Tag",{"$f":"'2023'!B6","v":"1) Regelmäßige Veranstaltungen "},null,{"$f":"'2023'!C6","v":"2) Einzelveranstaltungen, Projekte, Freizeiten, besondere Dienste "},null,{"$f":"'2023'!D6","v":"3) Gremien, Konvente"},null,{"$f":"'2023'!E6","v":"4) Sonstige Dienstpflichten "},null,{"$f":"'2023'!F6","v":"5) Entwicklung neuer Arbeitsansätze / Unvorhersehbares / seelsorgerische Begleitung Einzelner"},null,{"$f":"'2023'!G6","v":"6) sonstige Arbeitsfelder (z.B. Kirchenmusik) "},null,{"$f":"'2023'!H6","v":"Tagesarbeitszeit"},"siehe 1","Urlaub - Tag je als 1 eintragen 2","Krankheit und weitere personenbezogene  Freistellungen - Tag je als \"1\" eintragen 3",null,"Ort 4","geleistete AZ 5","geleistete Wochenstunden","Restarbeitszeit Jahr","verbleibende AZ im Jahr in Prozent","Anmerkung / Hinweis / Begründung 6",{"$f":"Januar!Z3","v":"Plausibilitätsprüfung "}]
["JAHR-SOLL",null,{"$f":"Stammdaten!B34","v":0},null,{"$f":"Stammdaten!B35","v":0},null,{"$f":"Stammdaten!B36","v":0},null,{"$f":"Stammdaten!B37","v":0},null,{"$f":"Stammdaten!B38","v":0},null,{"$f":"Stammdaten!B39","v":0},null,{"$f":"Stammdaten!B26","v":1287},null,{"$f":"Stammdaten!B7","v":30},"Tag 3"," Umrechnung in Stunden",null,{"$f":"Stammdaten!B26","v":1287}]
["JAHR-IST",null,{"$f":"'2023'!B8","v":0},null,{"$f":"'2023'!C8","v":0},null,{"$f":"'2023'!D8","v":0},null,{"$f":"'2023'!E8","v":0},null,{"$f":"'2023'!F8","v":0},null,{"$f":"'2023'!G8","v":0},null,{"$f":"'2023'!H8","v":0},null,{"$f":"Juli!Q5-August!Q45","v":30},null,{"$f":"SUM(S6:S44)","v":0},null,{"$f":"U4-W44","v":0}]
[null,"Mo",null,null,null,null,null,null,null,null,null,null,null,null,null,null,null,null,{"$f":"IF(R6=INTERN!$A$4,$R$1,\"0\")","v":"0"},null,{"$f":"SUM(C6:O6)+S6","v":0},null,null,null,null,{"$f":"IF(OR(AND(OR(C6<>\"\",E6<>\"\",G6<>\"\",I6<>\"\",K6<>\"\",M6<>\"\",O6<>\"\"),Q6<>\"\"),AND(OR(C6<>\"\",E6<>\"\",G6<>\"\",I6<>\"\",K6<>\"\",M6<>\"\",O6<>\"\"),R6<>\"\"),AND(Q6<>\"\",R6<>\"\")),\"Fehler\",\"\")","v":""}]
["1.8.","Die",null,null,null,null,null,null,null,null,null,null,null,null,null,null,null,null,{"$f":"IF(R7=INTERN!$A$4,$R$1,\"0\")","v":"0"},null,{"$f":"SUM(C7:O7)+S7","v":0},null,null,null,null,{"$f":"IF(OR(AND(OR(C7<>\"\",E7<>\"\",G7<>\"\",I7<>\"\",K7<>\"\",M7<>\"\",O7<>\"\"),Q7<>\"\"),AND(OR(C7<>\"\",E7<>\"\",G7<>\"\",I7<>\"\",K7<>\"\",M7<>\"\",O7<>\"\"),R7<>\"\"),AND(Q7<>\"\",R7<>\"\")),\"Fehler\",\"\")","v":""}]
["2.8.","Mi",null,null,null,null,null,null,null,null,null,null,null,null,null,null,null,null,{"$f":"IF(R8=INTERN!$A$4,$R$1,\"0\")","v":"0"},null,0,null,null,null,null,""]
["3.8.","Do",null,null,null,null,null,null,null,null,null,null,null,null,null,null,null,null,{"$f":"IF(R9=INTERN!$A$4,$R$1,\"0\")","v":"0"},null,0,null,null,null,null,""]
["4.8.","Fr",null,null,null,null,null,null,null,null,null,null,null,null,null,null,null,null,{"$f":"R10*R1","v":0},null,0,null,null,null,null,""]
["5.8.","Sa",null,null,null,null,null,null,null,null,null,null,null,null,null,null,null,null,null,null,{"$f":"SUM(C11:O11)","v":0},null,null,null,null,""]
["6.8.","So",null,null,null,null,null,null,null,null,null,null,null,null,null,null,null,null,null,null,{"$f":"SUM(C12:O12)","v":0},{"$f":"SUM(U6:U12)","v":0},{"$f":"Juli!W44-August!V12","v":1287},{"$f":"(W12*100)/U1","v":100},null,""]
["7.8.","Mo",null,null,null,null,null,null,null,null,null,null,null,null,null,null,null,null,{"$f":"IF(R13=INTERN!$A$4,$R$1,\"0\")","v":"0"},null,0,null,null,null,null,""]
["8.8.","Die",null,null,null,null,null,null,null,null,null,null,null,null,null,null,null,null,{"$f":"IF(R14=INTERN!$A$4,$R$1,\"0\")","v":"0"},null,0,null,null,null,null,""]
["9.8.","Mi",null,null,null,null,null,null,null,null,null,null,null,null,null,null,null,null,{"$f":"IF(R15=INTERN!$A$4,$R$1,\"0\")","v":"0"},null,0,null,null,null,null,""]
["10.8.","Do",null,null,null,null,null,null,null,null,null,null,null,null,null,null,null,null,{"$f":"IF(R16=INTERN!$A$4,$R$1,\"0\")","v":"0"},null,0,null,null,null,null,""]
["11.8.","Fr",null,null,null,null,null,null,null,null,null,null,null,null,null,null,null,null,{"$f":"R17*R1","v":0},null,0,null,null,null,null,""]
["12.8.","Sa",null,null,null,null,null,null,null,null,null,null,null,null,null,null,null,null,null,null,{"$f":"SUM(C18:O18)","v":0},null,null,null,null,""]
["13.8.","So",null,null,null,null,null,null,null,null,null,null,null,null,null,null,null,null,null,null,{"$f":"SUM(C19:O19)","v":0},{"$f":"SUM(U13:U19)","v":0},{"$f":"W12-V19","v":1287},{"$f":"(W19*100)/U1","v":100},null,""]
["14.8.","Mo",null,null,null,null,null,null,null,null,null,null,null,null,null,null,null,null,{"$f":"IF(R20=INTERN!$A$4,$R$1,\"0\")","v":"0"},null,0," ",null,null,null,""]
["15.8.","Die",null,null,null,null,null,null,null,null,null,null,null,null,null,null,null,null,{"$f":"IF(R21=INTERN!$A$4,$R$1,\"0\")","v":"0"},null,0,null,null,null,null,""]
["16.8.","Mi",null,null,null,null,null,null,null,null,null,null,null,null,null,null,null,null,{"$f":"IF(R22=INTERN!$A$4,$R$1,\"0\")","v":"0"},null,0,null,null,null,null,""]
["17.8.","Do",null,null,null,null,null,null,null,null,null,null,null,null,null,null,null,null,{"$f":"IF(R23=INTERN!$A$4,$R$1,\"0\")","v":"0"},null,0,null,null,null,null,""]
["18.8.","Fr",null,null,null,null,null,null,null,null,null,null,null,null,null,null,null,null,{"$f":"R24*R1","v":0},null,0,null,null,null,null,""]
["19.8.","Sa",null,null,null,null,null,null,null,null,null,null,null,null,null,null,null,null,null,null,{"$f":"SUM(C25:O25)","v":0},null,null,null,null,""]
["20.8.","So",null,null,null,null,null,null,null,null,null,null,null,null,null,null,null,null,null,null,{"$f":"SUM(C26:O26)","v":0},{"$f":"SUM(U20:U26)","v":0},{"$f":"W19-V26","v":1287},{"$f":"(W26*100)/U1","v":100},null,""]
["21.8.","Mo",null,null,null,null,null,null,null,null,null,null,null,null,null,null,null,null,{"$f":"IF(R27=INTERN!$A$4,$R$1,\"0\")","v":"0"},null,0,null,null,null,null,""]
["22.8.","Die",null,null,null,null,null,null,null,null,null,null,null,null,null,null,null,null,{"$f":"IF(R28=INTERN!$A$4,$R$1,\"0\")","v":"0"},null,0,null,null,null,null,""]
["23.8.","Mi",null,null,null,null,null,null,null,null,null,null,null,null,null,null,null,null,{"$f":"IF(R29=INTERN!$A$4,$R$1,\"0\")","v":"0"},null,0,null,null,null,null,""]
["24.8.","Do",null,null,null,null,null,null,null,null,null,null,null,null,null,null,null,null,{"$f":"IF(R30=INTERN!$A$4,$R$1,\"0\")","v":"0"},null,0,null,null,null,null,""]
["25.8.","Fr",null,null,null,null,null,null,null,null,null,null,null,null,null,null,null,null,{"$f":"R31*R1","v":0},null,0,null,null,null,null,""]
["26.8.","Sa",null,null,null,null,null,null,null,null,null,null,null,null,null,null,null,null,null,null,{"$f":"SUM(C32:O32)","v":0},null,null,null,null,""]
["27.8.","So",null,null,null,null,null,null,null,null,null,null,null,null,null,null,null,null,null,null,{"$f":"SUM(C33:O33)","v":0},{"$f":"SUM(U27:U33)","v":0},{"$f":"W26-V33","v":1287},{"$f":"(W33*100)/U1","v":100},null,{"$f":"IF(OR(AND(OR(C33<>\"\",E33<>\"\",G33<>\"\",I33<>\"\",K33<>\"\",M33<>\"\",O33<>\"\"),Q33<>\"\"),AND(OR(C33<>\"\",E33<>\"\",G33<>\"\",I33<>\"\",K33<>\"\",M33<>\"\",O33<>\"\"),R33<>\"\"),AND(Q33<>\"\",R33<>\"\")),\"Fehler\",\"\")","v":""}]
["28.8.","Mo",null,null,null,null,null,null,null,null,null,null,null,null,null,null,null,null,{"$f":"IF(R34=INTERN!$A$4,$R$1,\"0\")","v":"0"},null,0,null,null,null,null,""]
["29.8.","Die",null,null,null,null,null,null,null,null,null,null,null,null,null,null,null,null,{"$f":"IF(R35=INTERN!$A$4,$R$1,\"0\")","v":"0"},null,0,null,null,null,null,""]
["30.8.","Mi",null,null,null,null,null,null,null,null,null,null,null,null,null,null,null,null,{"$f":"IF(R36=INTERN!$A$4,$R$1,\"0\")","v":"0"},null,0,null,null,null,null,""]
["31.8.","Do",null,null,null,null,null,null,null,null,null,null,null,null,null,null,null,null,{"$f":"IF(R37=INTERN!$A$4,$R$1,\"0\")","v":"0"},null,0,null,null,null,null,""]
[null,"Fr",null,null,null,null,null,null,null,null,null,null,null,null,null,null,null,null,{"$f":"R38*R1","v":0},null,0,null,null,null,null,""]
[null,"Sa",null,null,null,null,null,null,null,null,null,null,null,null,null,null,null,null,null,null,{"$f":"SUM(C39:O39)","v":0},null,null,null,null,""]
[null,"So",null,null,null,null,null,null,null,null,null,null,null,null,null,null,null,null,null,null,{"$f":"SUM(C40:O40)","v":0},{"$f":"SUM(U34:U40)","v":0},{"$f":"W33-V40","v":1287},{"$f":"(W40*100)/U1","v":100},null,""]
[null,"Mo",null,null,null,null,null,null,null,null,null,null,null,null,null,null,null,null,{"$f":"IF(R41=INTERN!$A$4,$R$1,\"0\")","v":"0"},null,0,null,null,null,null,""]
[null,"Di",null,null,null,null,null,null,null,null,null,null,null,null,null,null,null,null,{"$f":"IF(R42=INTERN!$A$4,$R$1,\"0\")","v":"0"},null,0,null,null,null,null,""]
[null,"Mi",null,null,null,null,null,null,null,null,null,null,null,null,null,null,null,null,{"$f":"IF(R43=INTERN!$A$4,$R$1,\"0\")","v":"0"},null,0,null,null,null,null,""]
[null,"Do",null,null,null,null,null,null,null,null,null,null,null,null,null,null,null,null,{"$f":"IF(R44=INTERN!$A$4,$R$1,\"0\")","v":"0"},null,0,{"$f":"SUM(U41:U44)","v":0},{"$f":"W40-V44","v":1287},{"$f":"(W44*100)/U1","v":100},null,""]
[null,null,"gesamt",{"$f":"SUM(C6:D44)","v":0},"gesamt",{"$f":"SUM(E6:F44)","v":0},"gesamt",{"$f":"SUM(G6:G44)","v":0},"gesamt",{"$f":"SUM(I6:J44)","v":0},"gesamt",{"$f":"SUM(K6:L44)","v":0},"gesamt",{"$f":"SUM(M6:N44)","v":0},"gesamt",{"$f":"SUM(O6:P44)","v":0},{"$f":"SUM(Q6:Q44)","v":0},null,{"$f":"SUM(S6:S44)","v":0},"AUSDRUCK-ÜBERSICHT"]
[null,null,null,null,null,null,null,null,null,null,null,null,null,null,null,null,null,null,null,null,{"$f":"Juli!U46","v":"Übersicht über den Arbeitsstundenstand  \"Arbeitsfeld I und II\" laufender Monat"}]
[null,null,null,null,null,null,null,null,null,null,null,null,null,null,null,null,null,null,null,null,{"$f":"U4","v":1287},"Stunden",{"$f":"Juli!W47","v":"SOLL-Jahresarbeitszeit"}]
[null,null,null,null,null,null,null,null,null,null,null,null,null,null,null,null,null,null,null,null,{"$f":"U47-U49","v":0},"Stunden",{"$f":"Juli!W48","v":"bereits geleistete AZ am Ende des laufenden Monats "}]
[null,null,null,null,null,null,null,null,null,null,null,null,null,null,null,null,null,null,null,null,{"$f":"W44","v":1287},"Stunden",{"$f":"Juli!W49","v":"noch zu leistende AZ nach Ende des laufenden Monats (Restjahresarbeitszeit)"}]
[null,null,null,null,null,null,null,null,null,null,null,null,null,null,null,null,null,null,null,null,{"$f":"U49/4","v":321.75},"Stunden","Durchschnittliche monatliche Arbeitszeit September-Dezember, um Ende des Jahres ein ausgeglichenes Jahrsarbeitszeitkonto vorzuweisen. "]
[null,null,null,null,null,null,null,null,null,null,null,null,null,null,null,null,null,null,null,null,{"$f":"Juli!U5/5","v":0},"Stunden",{"$f":"Juli!W51","v":"Durchschnittliche bisherige monatliche Arbeitszeit zum Ende des Vormonats."}]
["1 Spalte O/P: Die SpalteTagesarbeitszeit wird  im MODELL  A ausgefüllt. Dabei ist hier jeweils die Gesamtarbeitszeit pro Tag in einer Summe einzutragen. Eine  Aufteilung in einzelne Arbeitsbereiche wird nur im MODELL B vorgenommen (in Spalte C bis L). \nFür die Darstellung von MODELL A wird über der Spaltenbeschriftung im Kopf (M) auf das Minus geklickt. Überflüssige Spalten werden damit ausgeblendet. (Siehe auch Arbeitshilfe.) Für die Darstellung von MODELL B wird auf das Plus-Zeichen über Spalte O geklickt. "]
["2  Spalte Q: An Urlaubstagen ist immer die Zahl 1 (und nichts anderes) einzutragen. Zusätzlich ist darauf zu achten, dass an Urlaubstagen keine Arbeitszeit ausgefüllt wird. (Sonst würde der Widerspruch in der Tabelle dargestellt, dass an Urlaubstagen gearbeitet wird. Technisch lässt sich diese Fehldarstellung nicht ausschließen, sodass dieser Hinweis selber beachtet werden muss.) ACHTUNG: Weil an Wochendenen  keine Krankheits- und Urlaubstage eingetragen werden dürfen, sind diese Felder gesperrt. An gesetzlichen Feiertagen dürfen ebenfalls keine Urlaubstage eingetragen werden. \nMitarbeitende mit einer 6-Tage-Woche können Krankheits- und Urlaubstage jeweils freitags mit hinzuzählen. Alle anderen Wochentage sind jeweils nur für eine \"1\" freigegeben."]
["3 Spalte R/S: Je Krankheitstag oder/und personenbezogener Freistellung (Freistellung für Krankheit Kinder, Zusatzfreistellungstage z.B. für Kinder und Pflege) mit einer \"1\" angeben. Angerechnet wird zur Arbeitszeit die \"reguläre tägliche AZ im GP- oder Kirchenmusikalischen Dienst\" (Feld R1). ACHTUNG: Weil an Wochendenen  keine Krankheits- und Urlaubstagstage eingetragen werden dürfen, sind diese Felder gesperrt. An gesetzlichen Feiertagen dürfen ebenfalls keine Krankheitstage eingetragen werden. \nMitarbeitende mit einer 6-Tage-Woche können Krankheitstage jeweils freitags mit hinzuzählen (statt eine 1 eine 2 eintragen). Alle anderen Wochentage sind jeweils nur für eine \"1\" freigegeben."]
["4 Spalte T: Hier werden die Arbeitsorte des jeweiligen Tages eingetragen. Wegen der  begrenzten Spaltengröße empfiehlt es sich, eigene Kürzel festzulegen."]
["5 Spalte U, Zeile 4 und 5: JAHR-SOLL entspricht der Jahresplanung; JAHR-IST enthält die tagesaktuelle, schon geleistete AZ in diesem Bereich. "]
["6 Spalte Y: Platz für Anmerkungen.  ACHTUNG: Die Schrift passt sich der Größe des Feldes an. Bei viel Text wird die Schrift sehr klein. Im Bedarfsfall kann im Eingabefeld der Text angeschaut werden. Diese Form ist notwendig, um einen Ausdruck zu ermöglichen."]

{"sheet":"September","index":12,"n_rows":57,"n_cols":26,"rows_kept":57,"cut":false,"hidden":false,"merged":[[46,22,46,24],[48,22,48,24],[43,12,43,13],[44,19,44,24],[45,20,45,24],[47,22,47,24],[40,21,42,21],[40,22,42,22],[42,14,42,15],[43,14,43,15],[24,16,25,18],[31,16,32,18],[38,16,39,18],[39,14,39,15],[36,14,36,15],[37,14,37,15],[55,0,55,24],[56,0,56,24],[49,22,49,24],[50,22,50,24],[51,0,51,24],[52,0,52,24],[53,0,53,24],[54,0,54,24],[43,2,43,3],[43,4,43,5],[43,6,43,7],[43,8,43,9],[43,10,43,11],[40,23,42,23],[41,2,41,3],[41,4,41,5],[41,6,41,7],[41,8,41,9],[42,2,42,3],[42,4,42,5],[41,10,41,11],[41,12,41,13],[41,14,41,15],[42,6,42,7],[42,8,42,9],[42,10,42,11],[42,12,42,13],[40,10,40,11],[40,12,40,13],[40,14,40,15],[39,10,39,11],[38,2,38,3],[38,4,38,5],[40,2,40,3],[40,4,40,5],[40,6,40,7],[40,8,40,9],[39,2,39,3],[39,4,39,5],[39,6,39,7],[39,8,39,9],[39,12,39,13],[38,6,38,7],[38,8,38,9],[38,10,38,11],[38,12,38,13],[38,14,38,15],[33,4,33,5],[36,8,36,9],[36,10,36,11],[37,12,37,13],[37,2,37,3],[37,4,37,5],[37,6,37,7],[36,2,36,3],[36,4,36,5],[36,6,36,7],[34,2,34,3],[34,4,34,5],[34,6,34,7],[34,8,34,9],[34,10,34,11],[33,2,33,3],[33,6,33,7],[35,2,35,3],[35,4,35,5],[35,6,35,7],[33,23,38,23],[34,14,34,15],[35,14,35,15],[37,8,37,9],[37,10,37,11],[33,21,38,21],[33,22,38,22],[36,12,36,13],[35,8,35,9],[35,10,35,11],[33,14,33,15],[33,8,33,9],[33,10,33,11],[33,12,33,13],[35,12,35,13],[34,12,34,13],[32,14,32,15],[31,2,31,3],[31,4,31,5],[31,6,31,7],[31,8,31,9],[31,10,31,11],[31,12,31,13],[32,2,32,3],[32,4,32,5],[32,6,32,7],[32,8,32,9],[32,10,32,11],[32,12,32,13],[30,14,30,15],[31,14,31,15],[29,8,29,9],[29,10,29,11],[29,12,29,13],[30,12,30,13],[28,6,28,7],[30,2,30,3],[30,4,30,5],[30,6,30,7],[29,2,29,3],[29,4,29,5],[29,6,29,7],[28,2,28,3],[28,4,28,5],[28,8,28,9],[28,10,28,11],[26,14,26,15],[27,2,27,3],[27,4,27,5],[27,6,27,7],[29,14,29,15],[25,2,25,3],[25,4,25,5],[25,6,25,7],[26,23,31,23],[27,14,27,15],[28,14,28,15],[30,8,30,9],[30,10,30,11],[28,12,28,13],[26,21,31,21],[25,8,25,9],[25,10,25,11],[25,12,25,13],[27,8,27,9],[27,10,27,11],[25,14,25,15],[26,22,31,22],[27,12,27,13],[26,2,26,3],[26,4,26,5],[26,6,26,7],[26,8,26,9],[26,10,26,11],[26,12,26,13],[23,2,23,3],[23,4,23,5],[23,6,23,7],[22,2,22,3],[22,4,22,5],[22,6,22,7],[24,2,24,3],[24,4,24,5],[24,6,24,7],[19,14,19,15],[19,23,24,23],[20,14,20,15],[21,14,21,15],[23,8,23,9],[23,10,23,11],[21,12,21,13],[19,21,24,21],[19,22,24,22],[20,12,20,13],[20,8,20,9],[20,10,20,11],[21,8,21,9],[21,10,21,11],[22,14,22,15],[23,14,23,15],[24,14,24,15],[22,8,22,9],[22,10,22,11],[22,12,22,13],[23,12,23,13],[24,8,24,9],[24,10,24,11],[24,12,24,13],[21,4,21,5],[21,6,21,7],[18,2,18,3],[18,4,18,5],[18,6,18,7],[18,8,18,9],[18,10,18,11],[18,12,18,13],[17,2,17,3],[17,4,17,5],[19,2,19,3],[19,4,19,5],[19,6,19,7],[19,8,19,9],[19,10,19,11],[19,12,19,13],[20,2,20,3],[20,4,20,5],[20,6,20,7],[21,2,21,3],[15,4,15,5],[15,6,15,7],[17,6,17,7],[17,8,17,9],[15,2,15,3],[12,23,17,23],[13,14,13,15],[14,14,14,15],[16,8,16,9],[16,10,16,11],[12,21,17,21],[12,22,17,22],[14,2,14,3],[14,4,14,5],[14,6,14,7],[16,2,16,3],[16,4,16,5],[16,6,16,7],[12,2,12,3],[12,4,12,5],[12,6,12,7],[12,8,12,9],[13,2,13,3],[13,4,13,5],[18,14,18,15],[17,10,17,11],[17,12,17,13],[15,14,15,15],[17,16,18,18],[13,10,13,11],[14,8,14,9],[14,10,14,11],[16,14,16,15],[17,14,17,15],[15,8,15,9],[15,10,15,11],[15,12,15,13],[14,12,14,13],[13,12,13,13],[16,12,16,13],[13,6,13,7],[13,8,13,9],[12,10,12,11],[12,12,12,13],[12,14,12,15],[11,2,11,3],[11,4,11,5],[11,6,11,7],[11,8,11,9],[11,10,11,11],[11,12,11,13],[11,14,11,15],[8,8,8,9],[8,10,8,11],[8,14,8,15],[9,14,9,15],[10,6,10,7],[10,8,10,9],[10,10,10,11],[9,10,9,11],[9,12,9,13],[10,14,10,15],[9,6,9,7],[9,8,9,9],[5,23,10,23],[6,2,6,3],[6,4,6,5],[6,6,6,7],[6,8,6,9],[6,10,6,11],[6,12,6,13],[6,14,6,15],[9,2,9,3],[9,4,9,5],[5,21,10,21],[5,22,10,22],[7,14,7,15],[8,2,8,3],[8,4,8,5],[8,6,8,7],[7,10,7,11],[7,12,7,13],[10,2,10,3],[10,4,10,5],[10,16,11,18],[5,14,5,15],[8,12,8,13],[10,12,10,13],[4,0,4,1],[4,2,4,3],[4,4,4,5],[4,6,4,7],[4,8,4,9],[4,10,4,11],[7,6,7,7],[7,8,7,9],[4,12,4,13],[4,14,4,15],[5,2,5,3],[5,4,5,5],[5,6,5,7],[5,8,5,9],[5,10,5,11],[5,12,5,13],[7,2,7,3],[7,4,7,5],[3,0,3,1],[3,2,3,3],[3,4,3,5],[3,6,3,7],[3,8,3,9],[3,10,3,11],[3,12,3,13],[3,14,3,15],[2,2,2,3],[0,21,0,25],[1,21,1,25],[0,0,0,11],[0,14,0,16],[0,17,0,18],[2,17,2,18],[1,0,1,13],[2,4,2,5],[2,6,2,7],[2,8,2,9],[2,10,2,11],[2,12,2,13]]}
[{"$f":"Stammdaten!B3","v":0},null,null,null,null,null,null,null,null,null,null,null,null,null,{"$f":"Januar!O1","v":"reguläre tägliche AZ im GP-Dienst/ Kirchenmusik (Stunden)"},null,null,{"$f":"Stammdaten!B31","v":5.85},null,{"$f":"Januar!T1","v":"SOLL-AZ  im GP/KM-Dienst (Stunden)"},{"$f":"Stammdaten!B26","v":1287},"SEPTEMBER"]
[null,null,null,null,null,null,null,null,null,null,null,null,null,null,"a)  Angaben in Stunden (Bsp. 1,00=60min; 1,5=90min; 0,75=45min; 0,25=15min)",null,null,null,null,null,null,{"$f":"Januar!V2","v":"b)  Die Felder in dieser Farbe werden automatisch ausgefüllt."}]
[null,"Tag",{"$f":"'2023'!B6","v":"1) Regelmäßige Veranstaltungen "},null,{"$f":"'2023'!C6","v":"2) Einzelveranstaltungen, Projekte, Freizeiten, besondere Dienste "},null,{"$f":"'2023'!D6","v":"3) Gremien, Konvente"},null,{"$f":"'2023'!E6","v":"4) Sonstige Dienstpflichten "},null,{"$f":"'2023'!F6","v":"5) Entwicklung neuer Arbeitsansätze / Unvorhersehbares / seelsorgerische Begleitung Einzelner"},null,{"$f":"'2023'!G6","v":"6) sonstige Arbeitsfelder (z.B. Kirchenmusik) "},null,{"$f":"'2023'!H6","v":"Tagesarbeitszeit"},"siehe 1","Urlaub - Tag je als 1 eintragen  2","Krankheit und weitere personenbezogene  Freistellungen - Tag je als \"1\" eintragen 3",null,"Ort 4","geleistete AZ 5","geleistete Wochenstunden","Restarbeitszeit Jahr","verbleibende AZ im Jahr in Prozent","Anmerkung / Hinweis / Begründung 6",{"$f":"Januar!Z3","v":"Plausibilitätsprüfung "}]
["JAHR-SOLL",null,{"$f":"Stammdaten!B34","v":0},null,{"$f":"Stammdaten!B35","v":0},null,{"$f":"Stammdaten!B36","v":0},null,{"$f":"Stammdaten!B37","v":0},null,{"$f":"Stammdaten!B38","v":0},null,{"$f":"Stammdaten!B39","v":0},null,{"$f":"Stammdaten!B26","v":1287},null,{"$f":"Stammdaten!B7","v":30},"Tag 3"," Umrechnung in Stunden",null,{"$f":"Stammdaten!B26","v":1287}]
["JAHR-IST",null,{"$f":"'2023'!B8","v":0},null,{"$f":"'2023'!C8","v":0},null,{"$f":"'2023'!D8","v":0},null,{"$f":"'2023'!E8","v":0},null,{"$f":"'2023'!F8","v":0},null,{"$f":"'2023'!G8","v":0},null,{"$f":"'2023'!H8","v":0},null,{"$f":"August!Q5-September!Q45","v":30},null,{"$f":"SUM(S6:S44)","v":0},null,{"$f":"U4-W44","v":0}]
[null,"Mo",null,null,null,null,null,null,null,null,null,null,null,null,null,null,null,null,{"$f":"IF(R6=INTERN!$A$4,$R$1,\"0\")","v":"0"},null,{"$f":"SUM(C6:O6)+S6","v":0},null,null,null,null,{"$f":"IF(OR(AND(OR(C6<>\"\",E6<>\"\",G6<>\"\",I6<>\"\",K6<>\"\",M6<>\"\",O6<>\"\"),Q6<>\"\"),AND(OR(C6<>\"\",E6<>\"\",G6<>\"\",I6<>\"\",K6<>\"\",M6<>\"\",O6<>\"\"),R6<>\"\"),AND(Q6<>\"\",R6<>\"\")),\"Fehler\",\"\")","v":""}]
[null,"Die",null,null,null,null,null,null,null,null,null,null,null,null,null,null,null,null,{"$f":"IF(R7=INTERN!$A$4,$R$1,\"0\")","v":"0"},null,{"$f":"SUM(C7:O7)+S7","v":0},null,null,null,null,{"$f":"IF(OR(AND(OR(C7<>\"\",E7<>\"\",G7<>\"\",I7<>\"\",K7<>\"\",M7<>\"\",O7<>\"\"),Q7<>\"\"),AND(OR(C7<>\"\",E7<>\"\",G7<>\"\",I7<>\"\",K7<>\"\",M7<>\"\",O7<>\"\"),R7<>\"\"),AND(Q7<>\"\",R7<>\"\")),\"Fehler\",\"\")","v":""}]
[null,"Mi",null,null,null,null,null,null,null,null,null,null,null,null,null,null,null,null,{"$f":"IF(R8=INTERN!$A$4,$R$1,\"0\")","v":"0"},null,0,null,null,null,null,""]
[null,"Do",null,null,null,null,null,null,null,null,null,null,null,null,null,null,null,null,{"$f":"IF(R9=INTERN!$A$4,$R$1,\"0\")","v":"0"},null,0,null,null,null,null,""]
["1.9.","Fr",null,null,null,null,null,null,null,null,null,null,null,null,null,null,null,null,{"$f":"R10*R1","v":0},null,0,null,null,null,null,""]
["2.9.","Sa",null,null,null,null,null,null,null,null,null,null,null,null,null,null,null,null,null,null,{"$f":"SUM(C11:O11)","v":0},null,null,null,null,""]
["3.9.","So",null,null,null,null,null,null,null,null,null,null,null,null,null,null,null,null,null,null,{"$f":"SUM(C12:O12)","v":0},{"$f":"SUM(U6:U12)","v":0},{"$f":"August!W44-September!V12","v":1287},{"$f":"(W12*100)/U1","v":100},null,""]
["4.9.","Mo",null,null,null,null,null,null,null,null,null,null,null,null,null,null,null,null,{"$f":"IF(R13=INTERN!$A$4,$R$1,\"0\")","v":"0"},null,0,null,null,null,null,""]
["5.9.","Die",null,null,null,null,null,null,null,null,null,null,null,null,null,null,null,null,{"$f":"IF(R14=INTERN!$A$4,$R$1,\"0\")","v":"0"},null,0,null,null,null,null,""]
["6.9.","Mi",null,null,null,null,null,null,null,null,null,null,null,null,null,null,null,null,{"$f":"IF(R15=INTERN!$A$4,$R$1,\"0\")","v":"0"},null,0,null,null,null,null,""]
["7.9.","Do",null,null,null,null,null,null,null,null,null,null,null,null,null,null,null,null,{"$f":"IF(R16=INTERN!$A$4,$R$1,\"0\")","v":"0"},null,0,null,null,null,null,""]
["8.9.","Fr",null,null,null,null,null,null,null,null,null,null,null,null,null,null,null,null,{"$f":"R17*R1","v":0},null,0,null,null,null,null,""]
["9.9.","Sa",null,null,null,null,null,null,null,null,null,null,null,null,null,null,null,null,null,null,{"$f":"SUM(C18:O18)","v":0},null,null,null,null,""]
["10.9.","So",null,null,null,null,null,null,null,null,null,null,null,null,null,null,null,null,null,null,{"$f":"SUM(C19:O19)","v":0},{"$f":"SUM(U13:U19)","v":0},{"$f":"W12-V19","v":1287},{"$f":"(W19*100)/U1","v":100},null,""]
["11.9.","Mo",null,null,null,null,null,null,null,null,null,null,null,null,null,null,null,null,{"$f":"IF(R20=INTERN!$A$4,$R$1,\"0\")","v":"0"},null,0," ",null,null,null,""]
["12.9.","Die",null,null,null,null,null,null,null,null,null,null,null,null,null,null,null,null,{"$f":"IF(R21=INTERN!$A$4,$R$1,\"0\")","v":"0"},null,0,null,null,null,null,""]
["13.9.","Mi",null,null,null,null,null,null,null,null,null,null,null,null,null,null,null,null,{"$f":"IF(R22=INTERN!$A$4,$R$1,\"0\")","v":"0"},null,0,null,null,null,null,""]
["14.9.","Do",null,null,null,null,null,null,null,null,null,null,null,null,null,null,null,null,{"$f":"IF(R23=INTERN!$A$4,$R$1,\"0\")","v":"0"},null,0,null,null,null,null,""]
["15.9.","Fr",null,null,null,null,null,null,null,null,null,null,null,null,null,null,null,null,{"$f":"R24*R1","v":0},null,0,null,null,null,null,""]
["16.9.","Sa",null,null,null,null,null,null,null,null,null,null,null,null,null,null,null,null,null,null,{"$f":"SUM(C25:O25)","v":0},null,null,null,null,""]
["17.9.","So",null,null,null,null,null,null,null,null,null,null,null,null,null,null,null,null,null,null,{"$f":"SUM(C26:O26)","v":0},{"$f":"SUM(U20:U26)","v":0},{"$f":"W19-V26","v":1287},{"$f":"(W26*100)/U1","v":100},null,""]
["18.9.","Mo",null,null,null,null,null,null,null,null,null,null,null,null,null,null,null,null,{"$f":"IF(R27=INTERN!$A$4,$R$1,\"0\")","v":"0"},null,0,null,null,null,null,""]
["19.9.","Die",null,null,null,null,null,null,null,null,null,null,null,null,null,null,null,null,{"$f":"IF(R28=INTERN!$A$4,$R$1,\"0\")","v":"0"},null,0,null,null,null,null,""]
["20.9.","Mi",null,null,null,null,null,null,null,null,null,null,null,null,null,null,null,null,{"$f":"IF(R29=INTERN!$A$4,$R$1,\"0\")","v":"0"},null,0,null,null,null,null,""]
["21.9.","Do",null,null,null,null,null,null,null,null,null,null,null,null,null,null,null,null,{"$f":"IF(R30=INTERN!$A$4,$R$1,\"0\")","v":"0"},null,0,null,null,null,null,""]
["22.9.","Fr",null,null,null,null,null,null,null,null,null,null,null,null,null,null,null,null,{"$f":"R31*R1","v":0},null,0,null,null,null,null,""]
["23.9.","Sa",null,null,null,null,null,null,null,null,null,null,null,null,null,null,null,null,null,null,{"$f":"SUM(C32:O32)","v":0},null,null,null,null,""]
["24.9.","So",null,null,null,null,null,null,null,null,null,null,null,null,null,null,null,null,null,null,{"$f":"SUM(C33:O33)","v":0},{"$f":"SUM(U27:U33)","v":0},{"$f":"W26-V33","v":1287},{"$f":"(W33*100)/U1","v":100},null,{"$f":"IF(OR(AND(OR(C33<>\"\",E33<>\"\",G33<>\"\",I33<>\"\",K33<>\"\",M33<>\"\",O33<>\"\"),Q33<>\"\"),AND(OR(C33<>\"\",E33<>\"\",G33<>\"\",I33<>\"\",K33<>\"\",M33<>\"\",O33<>\"\"),R33<>\"\"),AND(Q33<>\"\",R33<>\"\")),\"Fehler\",\"\")","v":""}]
["25.9.","Mo",null,null,null,null,null,null,null,null,null,null,null,null,null,null,null,null,{"$f":"IF(R34=INTERN!$A$4,$R$1,\"0\")","v":"0"},null,0,null,null,null,null,""]
["26.9.","Die",null,null,null,null,null,null,null,null,null,null,null,null,null,null,null,null,{"$f":"IF(R35=INTERN!$A$4,$R$1,\"0\")","v":"0"},null,0,null,null,null,null,""]
["27.9.","Mi",null,null,null,null,null,null,null,null,null,null,null,null,null,null,null,null,{"$f":"IF(R36=INTERN!$A$4,$R$1,\"0\")","v":"0"},null,0,null,null,null,null,""]
["28.9.","Do",null,null,null,null,null,null,null,null,null,null,null,null,null,null,null,null,{"$f":"IF(R37=INTERN!$A$4,$R$1,\"0\")","v":"0"},null,0,null,null,null,null,""]
["29.9.","Fr",null,null,null,null,null,null,null,null,null,null,null,null,null,null,null,null,{"$f":"R38*R1","v":0},null,0,null,null,null,null,""]
["30.9.","Sa",null,null,null,null,null,null,null,null,null,null,null,null,null,null,null,null,null,null,{"$f":"SUM(C39:O39)","v":0},null,null,null,null,""]
[null,"So",null,null,null,null,null,null,null,null,null,null,null,null,null,null,null,null,null,null,{"$f":"SUM(C40:O40)","v":0},{"$f":"SUM(U34:U40)","v":0},{"$f":"W33-V40","v":1287},{"$f":"(W40*100)/U1","v":100},null,""]
[null,"Mo",null,null,null,null,null,null,null,null,null,null,null,null,null,null,null,null,{"$f":"IF(R41=INTERN!$A$4,$R$1,\"0\")","v":"0"},null,0,null,null,null,null,""]
[null,"Di",null,null,null,null,null,null,null,null,null,null,null,null,null,null,null,null,{"$f":"IF(R42=INTERN!$A$4,$R$1,\"0\")","v":"0"},null,0,null,null,null,null,""]
[null,"Mi",null,null,null,null,null,null,null,null,null,null,null,null,null,null,null,null,{"$f":"IF(R43=INTERN!$A$4,$R$1,\"0\")","v":"0"},null,0,null,null,null,null,""]
[null,"Do",null,null,null,null,null,null,null,null,null,null,null,null,null,null,null,null,{"$f":"IF(R44=INTERN!$A$4,$R$1,\"0\")","v":"0"},null,0,{"$f":"SUM(U41:U44)","v":0},{"$f":"W40-V44","v":1287},{"$f":"(W44*100)/U1","v":100},null,""]
[null,null,"gesamt",{"$f":"SUM(C6:D44)","v":0},"gesamt",{"$f":"SUM(E6:F44)","v":0},"gesamt",{"$f":"SUM(G6:G44)","v":0},"gesamt",{"$f":"SUM(I6:J44)","v":0},"gesamt",{"$f":"SUM(K6:L44)","v":0},"gesamt",{"$f":"SUM(M6:N44)","v":0},"gesamt",{"$f":"SUM(O6:P44)","v":0},{"$f":"SUM(Q6:Q44)","v":0},null,{"$f":"SUM(S6:S44)","v":0},"AUSDRUCK-ÜBERSICHT"]
[null,null,null,null,null,null,null,null,null,null,null,null,null,null,null,null,null,null,null,null,{"$f":"Juli!U46","v":"Übersicht über den Arbeitsstundenstand  \"Arbeitsfeld I und II\" laufender Monat"}]
[null,null,null,null,null,null,null,null,null,null,null,null,null,null,null,null,null,null,null,null,{"$f":"U4","v":1287},"Stunden",{"$f":"Juli!W47","v":"SOLL-Jahresarbeitszeit"}]
[null,null,null,null,null,null,null,null,null,null,null,null,null,null,null,null,null,null,null,null,{"$f":"U47-U49","v":0},"Stunden",{"$f":"Juli!W48","v":"bereits geleistete AZ am Ende des laufenden Monats "}]
[null,null,null,null,null,null,null,null,null,null,null,null,null,null,null,null,null,null,null,null,{"$f":"W44","v":1287},"Stunden",{"$f":"Juli!W49","v":"noch zu leistende AZ nach Ende des laufenden Monats (Restjahresarbeitszeit)"}]
[null,null,null,null,null,null,null,null,null,null,null,null,null,null,null,null,null,null,null,null,{"$f":"U49/3","v":429},"Stunden","Durchschnittliche monatliche Arbeitszeit Oktober-Dezember, um Ende des Jahres ein ausgeglichenes Jahrsarbeitszeitkonto vorzuweisen. "]
[null,null,null,null,null,null,null,null,null,null,null,null,null,null,null,null,null,null,null,null,{"$f":"August!U5/8","v":0},"Stunden",{"$f":"Juli!W51","v":"Durchschnittliche bisherige monatliche Arbeitszeit zum Ende des Vormonats."}]
["1 Spalte O/P: Die SpalteTagesarbeitszeit wird  im MODELL  A ausgefüllt. Dabei ist hier jeweils die Gesamtarbeitszeit pro Tag in einer Summe einzutragen. Eine  Aufteilung in einzelne Arbeitsbereiche wird nur im MODELL B vorgenommen (in Spalte C bis L). \nFür die Darstellung von MODELL A wird über der Spaltenbeschriftung im Kopf (M) auf das Minus geklickt. Überflüssige Spalten werden damit ausgeblendet. (Siehe auch Arbeitshilfe.) Für die Darstellung von MODELL B wird auf das Plus-Zeichen über Spalte O geklickt. "]
["2  Spalte Q: An Urlaubstagen ist immer die Zahl 1 (und nichts anderes) einzutragen. Zusätzlich ist darauf zu achten, dass an Urlaubstagen keine Arbeitszeit ausgefüllt wird. (Sonst würde der Widerspruch in der Tabelle dargestellt, dass an Urlaubstagen gearbeitet wird. Technisch lässt sich diese Fehldarstellung nicht ausschließen, sodass dieser Hinweis selber beachtet werden muss.) ACHTUNG: Weil an Wochendenen  keine Krankheits- und Urlaubstage eingetragen werden dürfen, sind diese Felder gesperrt. An gesetzlichen Feiertagen dürfen ebenfalls keine Urlaubstage eingetragen werden. \nMitarbeitende mit einer 6-Tage-Woche können Krankheits- und Urlaubstage jeweils freitags mit hinzuzählen. Alle anderen Wochentage sind jeweils nur für eine \"1\" freigegeben."]
["3 Spalte R/S: Je Krankheitstag oder/und personenbezogener Freistellung (Freistellung für Krankheit Kinder, Zusatzfreistellungstage z.B. für Kinder und Pflege) mit einer \"1\" angeben. Angerechnet wird zur Arbeitszeit die \"reguläre tägliche AZ im GP- oder Kirchenmusikalischen Dienst\" (Feld R1). ACHTUNG: Weil an Wochendenen  keine Krankheits- und Urlaubstagstage eingetragen werden dürfen, sind diese Felder gesperrt. An gesetzlichen Feiertagen dürfen ebenfalls keine Krankheitstage eingetragen werden. \nMitarbeitende mit einer 6-Tage-Woche können Krankheitstage jeweils freitags mit hinzuzählen (statt eine 1 eine 2 eintragen). Alle anderen Wochentage sind jeweils nur für eine \"1\" freigegeben."]
["4 Spalte T: Hier werden die Arbeitsorte des jeweiligen Tages eingetragen. Wegen der  begrenzten Spaltengröße empfiehlt es sich, eigene Kürzel festzulegen."]
["5 Spalte U, Zeile 4 und 5: JAHR-SOLL entspricht der Jahresplanung; JAHR-IST enthält die tagesaktuelle, schon geleistete AZ in diesem Bereich. "]
["6 Spalte Y: Platz für Anmerkungen.  ACHTUNG: Die Schrift passt sich der Größe des Feldes an. Bei viel Text wird die Schrift sehr klein. Im Bedarfsfall kann im Eingabefeld der Text angeschaut werden. Diese Form ist notwendig, um einen Ausdruck zu ermöglichen."]

{"sheet":"Oktober","index":13,"n_rows":57,"n_cols":26,"rows_kept":57,"cut":false,"hidden":false,"merged":[[1,0,1,13],[2,2,2,3],[2,4,2,5],[2,6,2,7],[2,8,2,9],[0,0,0,11],[0,14,0,16],[0,17,0,18],[3,0,3,1],[3,2,3,3],[2,17,2,18],[2,10,2,11],[2,12,2,13],[3,4,3,5],[3,6,3,7],[3,8,3,9],[3,10,3,11],[3,12,3,13],[3,14,3,15],[4,0,4,1],[4,2,4,3],[4,4,4,5],[4,6,4,7],[4,8,4,9],[4,10,4,11],[4,12,4,13],[4,14,4,15],[5,2,5,3],[5,4,5,5],[5,6,5,7],[5,8,5,9],[5,10,5,11],[5,12,5,13],[5,14,5,15],[5,21,10,21],[5,22,10,22],[5,23,10,23],[6,2,6,3],[6,4,6,5],[6,6,6,7],[6,8,6,9],[6,10,6,11],[6,12,6,13],[6,14,6,15],[10,16,11,18],[7,14,7,15],[8,14,8,15],[8,2,8,3],[8,4,8,5],[8,6,8,7],[8,8,8,9],[8,10,8,11],[8,12,8,13],[7,2,7,3],[7,4,7,5],[7,6,7,7],[7,8,7,9],[7,10,7,11],[7,12,7,13],[11,2,11,3],[11,4,11,5],[11,6,11,7],[11,8,11,9],[11,10,11,11],[11,12,11,13],[11,14,11,15],[9,14,9,15],[10,2,10,3],[10,4,10,5],[10,6,10,7],[10,8,10,9],[10,10,10,11],[10,12,10,13],[10,14,10,15],[9,2,9,3],[9,4,9,5],[9,6,9,7],[9,8,9,9],[9,10,9,11],[9,12,9,13],[12,14,12,15],[12,21,17,21],[12,22,17,22],[12,23,17,23],[13,2,13,3],[13,4,13,5],[13,6,13,7],[13,8,13,9],[13,10,13,11],[13,12,13,13],[12,2,12,3],[12,4,12,5],[12,6,12,7],[12,8,12,9],[12,10,12,11],[12,12,12,13],[17,16,18,18],[13,14,13,15],[14,14,14,15],[15,14,15,15],[14,2,14,3],[14,4,14,5],[14,6,14,7],[14,8,14,9],[14,10,14,11],[14,12,14,13],[15,2,15,3],[18,14,18,15],[17,2,17,3],[17,4,17,5],[17,6,17,7],[17,8,17,9],[17,10,17,11],[17,12,17,13],[18,2,18,3],[18,4,18,5],[16,14,16,15],[17,14,17,15],[16,2,16,3],[16,4,16,5],[16,6,16,7],[16,8,16,9],[16,10,16,11],[16,12,16,13],[15,4,15,5],[15,6,15,7],[15,8,15,9],[15,10,15,11],[15,12,15,13],[18,6,18,7],[18,8,18,9],[18,10,18,11],[18,12,18,13],[19,2,19,3],[19,4,19,5],[19,6,19,7],[19,8,19,9],[19,10,19,11],[19,12,19,13],[19,14,19,15],[19,21,24,21],[19,22,24,22],[19,23,24,23],[20,2,20,3],[20,4,20,5],[20,6,20,7],[20,8,20,9],[20,10,20,11],[20,12,20,13],[24,16,25,18],[20,14,20,15],[21,14,21,15],[22,14,22,15],[21,2,21,3],[21,4,21,5],[21,6,21,7],[21,8,21,9],[21,10,21,11],[21,12,21,13],[22,2,22,3],[25,14,25,15],[24,2,24,3],[24,4,24,5],[25,2,25,3],[25,4,25,5],[23,14,23,15],[24,14,24,15],[23,2,23,3],[23,4,23,5],[23,6,23,7],[23,8,23,9],[23,10,23,11],[23,12,23,13],[22,4,22,5],[22,6,22,7],[22,8,22,9],[22,10,22,11],[22,12,22,13],[25,6,25,7],[25,8,25,9],[25,10,25,11],[25,12,25,13],[24,6,24,7],[24,8,24,9],[24,10,24,11],[24,12,24,13],[26,2,26,3],[26,4,26,5],[26,6,26,7],[26,8,26,9],[26,10,26,11],[26,12,26,13],[26,14,26,15],[26,21,31,21],[26,22,31,22],[31,12,31,13],[29,4,29,5],[29,6,29,7],[29,8,29,9],[29,10,29,11],[29,12,29,13],[26,23,31,23],[27,2,27,3],[27,4,27,5],[27,6,27,7],[27,8,27,9],[27,10,27,11],[27,12,27,13],[31,16,32,18],[27,14,27,15],[28,14,28,15],[29,14,29,15],[28,2,28,3],[28,4,28,5],[28,6,28,7],[28,8,28,9],[28,10,28,11],[28,12,28,13],[29,2,29,3],[32,14,32,15],[31,2,31,3],[31,4,31,5],[31,6,31,7],[31,8,31,9],[31,10,31,11],[32,2,32,3],[32,4,32,5],[30,14,30,15],[31,14,31,15],[30,2,30,3],[30,4,30,5],[30,6,30,7],[30,8,30,9],[30,10,30,11],[30,12,30,13],[32,6,32,7],[32,8,32,9],[32,10,32,11],[32,12,32,13],[33,2,33,3],[33,4,33,5],[33,6,33,7],[33,8,33,9],[33,10,33,11],[33,12,33,13],[33,14,33,15],[33,21,38,21],[33,22,38,22],[38,12,38,13],[36,4,36,5],[36,6,36,7],[36,8,36,9],[36,10,36,11],[36,12,36,13],[33,23,38,23],[34,2,34,3],[34,4,34,5],[34,6,34,7],[34,8,34,9],[34,10,34,11],[34,12,34,13],[38,16,39,18],[34,14,34,15],[35,14,35,15],[36,14,36,15],[35,2,35,3],[35,4,35,5],[35,6,35,7],[35,8,35,9],[35,10,35,11],[35,12,35,13],[36,2,36,3],[39,14,39,15],[38,2,38,3],[38,4,38,5],[38,6,38,7],[38,8,38,9],[38,10,38,11],[42,14,42,15],[40,14,40,15],[39,2,39,3],[39,4,39,5],[37,14,37,15],[38,14,38,15],[37,2,37,3],[37,4,37,5],[37,6,37,7],[37,8,37,9],[37,10,37,11],[37,12,37,13],[0,21,0,25],[1,21,1,25],[55,0,55,24],[43,14,43,15],[44,19,44,24],[45,20,45,24],[46,22,46,24],[40,23,42,23],[39,6,39,7],[39,8,39,9],[39,10,39,11],[39,12,39,13],[41,2,41,3],[41,4,41,5],[41,6,41,7],[41,8,41,9],[41,10,41,11],[41,12,41,13],[40,2,40,3],[40,4,40,5],[40,6,40,7],[40,8,40,9],[40,10,40,11],[40,12,40,13],[56,0,56,24],[49,22,49,24],[50,22,50,24],[51,0,51,24],[52,0,52,24],[53,0,53,24],[54,0,54,24],[41,14,41,15],[42,2,42,3],[47,22,47,24],[48,22,48,24],[43,2,43,3],[43,4,43,5],[43,6,43,7],[43,8,43,9],[43,10,43,11],[43,12,43,13],[40,21,42,21],[40,22,42,22],[42,4,42,5],[42,6,42,7],[42,8,42,9],[42,10,42,11],[42,12,42,13]]}
[{"$f":"Stammdaten!B3","v":0},null,null,null,null,null,null,null,null,null,null,null,null,null,{"$f":"Januar!O1","v":"reguläre tägliche AZ im GP-Dienst/ Kirchenmusik (Stunden)"},null,null,{"$f":"Stammdaten!B31","v":5.85},null,{"$f":"Januar!T1","v":"SOLL-AZ  im GP/KM-Dienst (Stunden)"},{"$f":"Stammdaten!B26","v":1287},"OKTOBER"]
[null,null,null,null,null,null,null,null,null,null,null,null,null,null,"a)  Angaben in Stunden (Bsp. 1,00=60min; 1,5=90min; 0,75=45min; 0,25=15min)",null,null,null,null,null,null,{"$f":"Januar!V2","v":"b)  Die Felder in dieser Farbe werden automatisch ausgefüllt."}]
[null,"Tag",{"$f":"'2023'!B6","v":"1) Regelmäßige Veranstaltungen "},null,{"$f":"'2023'!C6","v":"2) Einzelveranstaltungen, Projekte, Freizeiten, besondere Dienste "},null,{"$f":"'2023'!D6","v":"3) Gremien, Konvente"},null,{"$f":"'2023'!E6","v":"4) Sonstige Dienstpflichten "},null,{"$f":"'2023'!F6","v":"5) Entwicklung neuer Arbeitsansätze / Unvorhersehbares / seelsorgerische Begleitung Einzelner"},null,{"$f":"'2023'!G6","v":"6) sonstige Arbeitsfelder (z.B. Kirchenmusik) "},null,{"$f":"'2023'!H6","v":"Tagesarbeitszeit"},"siehe 1","Urlaub - Tag je als 1 eintragen  2","Krankheit und weitere personenbezogene  Freistellungen - Tag je als \"1\" eintragen 3",null,"Ort 4","geleistete AZ 5","geleistete Wochenstunden","Restarbeitszeit Jahr","verbleibende AZ im Jahr in Prozent","Anmerkung / Hinweis / Begründung 6",{"$f":"Januar!Z3","v":"Plausibilitätsprüfung "}]
["JAHR-SOLL",null,{"$f":"Stammdaten!B34","v":0},null,{"$f":"Stammdaten!B35","v":0},null,{"$f":"Stammdaten!B36","v":0},null,{"$f":"Stammdaten!B37","v":0},null,{"$f":"Stammdaten!B38","v":0},null,{"$f":"Stammdaten!B39","v":0},null,{"$f":"Stammdaten!B26","v":1287},null,{"$f":"Stammdaten!B7","v":30},"Tag 3"," Umrechnung in Stunden",null,{"$f":"Stammdaten!B26","v":1287}]
["JAHR-IST",null,{"$f":"'2023'!B8","v":0},null,{"$f":"'2023'!C8","v":0},null,{"$f":"'2023'!D8","v":0},null,{"$f":"'2023'!E8","v":0},null,{"$f":"'2023'!F8","v":0},null,{"$f":"'2023'!G8","v":0},null,{"$f":"'2023'!H8","v":0},null,{"$f":"September!Q5-Oktober!Q45","v":30},null,{"$f":"SUM(S6:S44)","v":0},null,{"$f":"U4-W44","v":0}]
[null,"Mo",null,null,null,null,null,null,null,null,null,null,null,null,null,null,null,null,{"$f":"IF(R6=INTERN!$A$4,$R$1,\"0\")","v":"0"},null,{"$f":"SUM(C6:O6)+S6","v":0},null,null,null,null,{"$f":"IF(OR(AND(OR(C6<>\"\",E6<>\"\",G6<>\"\",I6<>\"\",K6<>\"\",M6<>\"\",O6<>\"\"),Q6<>\"\"),AND(OR(C6<>\"\",E6<>\"\",G6<>\"\",I6<>\"\",K6<>\"\",M6<>\"\",O6<>\"\"),R6<>\"\"),AND(Q6<>\"\",R6<>\"\")),\"Fehler\",\"\")","v":""}]
[null,"Die",null,null,null,null,null,null,null,null,null,null,null,null,null,null,null,null,{"$f":"IF(R7=INTERN!$A$4,$R$1,\"0\")","v":"0"},null,{"$f":"SUM(C7:O7)+S7","v":0},null,null,null,null,{"$f":"IF(OR(AND(OR(C7<>\"\",E7<>\"\",G7<>\"\",I7<>\"\",K7<>\"\",M7<>\"\",O7<>\"\"),Q7<>\"\"),AND(OR(C7<>\"\",E7<>\"\",G7<>\"\",I7<>\"\",K7<>\"\",M7<>\"\",O7<>\"\"),R7<>\"\"),AND(Q7<>\"\",R7<>\"\")),\"Fehler\",\"\")","v":""}]
[null,"Mi",null,null,null,null,null,null,null,null,null,null,null,null,null,null,null,null,{"$f":"IF(R8=INTERN!$A$4,$R$1,\"0\")","v":"0"},null,0,null,null,null,null,""]
[null,"Do",null,null,null,null,null,null,null,null,null,null,null,null,null,null,null,null,{"$f":"IF(R9=INTERN!$A$4,$R$1,\"0\")","v":"0"},null,0,null,null,null,null,""]
[null,"Fr",null,null,null,null,null,null,null,null,null,null,null,null,null,null,null,null,{"$f":"R10*R1","v":0},null,0,null,null,null,null,""]
[null,"Sa",null,null,null,null,null,null,null,null,null,null,null,null,null,null,null,null,null,null,{"$f":"SUM(C11:O11)","v":0},null,null,null,null,""]
["1.10.","So",null,null,null,null,null,null,null,null,null,null,null,null,null,null,null,null,null,null,{"$f":"SUM(C12:O12)","v":0},{"$f":"SUM(U6:U12)","v":0},{"$f":"September!W44-Oktober!V12","v":1287},{"$f":"(W12*100)/U1","v":100},null,""]
["2.10.","Mo",null,null,null,null,null,null,null,null,null,null,null,null,null,null,null,null,{"$f":"IF(R13=INTERN!$A$4,$R$1,\"0\")","v":"0"},null,0,null,null,null,null,""]
["3.10.","Die",null,null,null,null,null,null,null,null,null,null,null,null,null,null,null,null,{"$f":"IF(R14=INTERN!$A$4,$R$1,\"0\")","v":"0"},null,0,null,null,null,null,""]
["4.10.","Mi",null,null,null,null,null,null,null,null,null,null,null,null,null,null,null,null,{"$f":"IF(R15=INTERN!$A$4,$R$1,\"0\")","v":"0"},null,0,null,null,null,null,""]
["5.10.","Do",null,null,null,null,null,null,null,null,null,null,null,null,null,null,null,null,{"$f":"IF(R16=INTERN!$A$4,$R$1,\"0\")","v":"0"},null,0,null,null,null,null,""]
["6.10.","Fr",null,null,null,null,null,null,null,null,null,null,null,null,null,null,null,null,{"$f":"R17*R1","v":0},null,0,null,null,null,null,""]
["7.10.","Sa",null,null,null,null,null,null,null,null,null,null,null,null,null,null,null,null,null,null,{"$f":"SUM(C18:O18)","v":0},null,null,null,null,""]
["8.10.","So",null,null,null,null,null,null,null,null,null,null,null,null,null,null,null,null,null,null,{"$f":"SUM(C19:O19)","v":0},{"$f":"SUM(U13:U19)","v":0},{"$f":"W12-V19","v":1287},{"$f":"(W19*100)/U1","v":100},null,""]
["9.10.","Mo",null,null,null,null,null,null,null,null,null,null,null,null,null,null,null,null,{"$f":"IF(R20=INTERN!$A$4,$R$1,\"0\")","v":"0"},null,0," ",null,null,null,""]
["10.10.","Die",null,null,null,null,null,null,null,null,null,null,null,null,null,null,null,null,{"$f":"IF(R21=INTERN!$A$4,$R$1,\"0\")","v":"0"},null,0,null,null,null,null,""]
["11.10.","Mi",null,null,null,null,null,null,null,null,null,null,null,null,null,null,null,null,{"$f":"IF(R22=INTERN!$A$4,$R$1,\"0\")","v":"0"},null,0,null,null,null,null,""]
["12.10.","Do",null,null,null,null,null,null,null,null,null,null,null,null,null,null,null,null,{"$f":"IF(R23=INTERN!$A$4,$R$1,\"0\")","v":"0"},null,0,null,null,null,null,""]
["13.10.","Fr",null,null,null,null,null,null,null,null,null,null,null,null,null,null,null,null,{"$f":"R24*R1","v":0},null,0,null,null,null,null,""]
["14.10.","Sa",null,null,null,null,null,null,null,null,null,null,null,null,null,null,null,null,null,null,{"$f":"SUM(C25:O25)","v":0},null,null,null,null,""]
["15.10.","So",null,null,null,null,null,null,null,null,null,null,null,null,null,null,null,null,null,null,{"$f":"SUM(C26:O26)","v":0},{"$f":"SUM(U20:U26)","v":0},{"$f":"W19-V26","v":1287},{"$f":"(W26*100)/U1","v":100},null,""]
["16.10.","Mo",null,null,null,null,null,null,null,null,null,null,null,null,null,null,null,null,{"$f":"IF(R27=INTERN!$A$4,$R$1,\"0\")","v":"0"},null,0,null,null,null,null,""]
["17.10.","Die",null,null,null,null,null,null,null,null,null,null,null,null,null,null,null,null,{"$f":"IF(R28=INTERN!$A$4,$R$1,\"0\")","v":"0"},null,0,null,null,null,null,""]
["18.10.","Mi",null,null,null,null,null,null,null,null,null,null,null,null,null,null,null,null,{"$f":"IF(R29=INTERN!$A$4,$R$1,\"0\")","v":"0"},null,0,null,null,null,null,""]
["19.10.","Do",null,null,null,null,null,null,null,null,null,null,null,null,null,null,null,null,{"$f":"IF(R30=INTERN!$A$4,$R$1,\"0\")","v":"0"},null,0,null,null,null,null,""]
["20.10.","Fr",null,null,null,null,null,null,null,null,null,null,null,null,null,null,null,null,{"$f":"R31*R1","v":0},null,0,null,null,null,null,""]
["21.10.","Sa",null,null,null,null,null,null,null,null,null,null,null,null,null,null,null,null,null,null,{"$f":"SUM(C32:O32)","v":0},null,null,null,null,""]
["22.10.","So",null,null,null,null,null,null,null,null,null,null,null,null,null,null,null,null,null,null,{"$f":"SUM(C33:O33)","v":0},{"$f":"SUM(U27:U33)","v":0},{"$f":"W26-V33","v":1287},{"$f":"(W33*100)/U1","v":100},null,{"$f":"IF(OR(AND(OR(C33<>\"\",E33<>\"\",G33<>\"\",I33<>\"\",K33<>\"\",M33<>\"\",O33<>\"\"),Q33<>\"\"),AND(OR(C33<>\"\",E33<>\"\",G33<>\"\",I33<>\"\",K33<>\"\",M33<>\"\",O33<>\"\"),R33<>\"\"),AND(Q33<>\"\",R33<>\"\")),\"Fehler\",\"\")","v":""}]
["23.10.","Mo",null,null,null,null,null,null,null,null,null,null,null,null,null,null,null,null,{"$f":"IF(R34=INTERN!$A$4,$R$1,\"0\")","v":"0"},null,0,null,null,null,null,""]
["24.10.","Die",null,null,null,null,null,null,null,null,null,null,null,null,null,null,null,null,{"$f":"IF(R35=INTERN!$A$4,$R$1,\"0\")","v":"0"},null,0,null,null,null,null,""]
["25.10.","Mi",null,null,null,null,null,null,null,null,null,null,null,null,null,null,null,null,{"$f":"IF(R36=INTERN!$A$4,$R$1,\"0\")","v":"0"},null,0,null,null,null,null,""]
["26.10.","Do",null,null,null,null,null,null,null,null,null,null,null,null,null,null,null,null,{"$f":"IF(R37=INTERN!$A$4,$R$1,\"0\")","v":"0"},null,0,null,null,null,null,""]
["27.10.","Fr",null,null,null,null,null,null,null,null,null,null,null,null,null,null,null,null,{"$f":"R38*R1","v":0},null,0,null,null,null,null,""]
["28.10.","Sa",null,null,null,null,null,null,null,null,null,null,null,null,null,null,null,null,null,null,{"$f":"SUM(C39:O39)","v":0},null,null,null,null,""]
["29.10.","So",null,null,null,null,null,null,null,null,null,null,null,null,null,null,null,null,null,null,{"$f":"SUM(C40:O40)","v":0},{"$f":"SUM(U34:U40)","v":0},{"$f":"W33-V40","v":1287},{"$f":"(W40*100)/U1","v":100},null,""]
["30.10.","Mo",null,null,null,null,null,null,null,null,null,null,null,null,null,null,null,null,{"$f":"IF(R41=INTERN!$A$4,$R$1,\"0\")","v":"0"},null,0,null,null,null,null,""]
["31.10.","Di",null,null,null,null,null,null,null,null,null,null,null,null,null,null,null,null,{"$f":"IF(R42=INTERN!$A$4,$R$1,\"0\")","v":"0"},null,0,null,null,null,null,""]
[null,"Mi",null,null,null,null,null,null,null,null,null,null,null,null,null,null,null,null,{"$f":"IF(R43=INTERN!$A$4,$R$1,\"0\")","v":"0"},null,0,null,null,null,null,""]
[null,"Do",null,null,null,null,null,null,null,null,null,null,null,null,null,null,null,null,{"$f":"IF(R44=INTERN!$A$4,$R$1,\"0\")","v":"0"},null,{"$f":"SUM(C44:O44)+S44","v":0},{"$f":"SUM(U41:U44)","v":0},{"$f":"W40-V44","v":1287},{"$f":"(W44*100)/U1","v":100},null,""]
[null,null,"gesamt",{"$f":"SUM(C6:D44)","v":0},"gesamt",{"$f":"SUM(E6:F44)","v":0},"gesamt",{"$f":"SUM(G6:G44)","v":0},"gesamt",{"$f":"SUM(I6:J44)","v":0},"gesamt",{"$f":"SUM(K6:L44)","v":0},"gesamt",{"$f":"SUM(M6:N44)","v":0},"gesamt",{"$f":"SUM(O6:P44)","v":0},{"$f":"SUM(Q6:Q44)","v":0},null,{"$f":"SUM(S6:S44)","v":0},"AUSDRUCK-ÜBERSICHT"]
[null,null,null,null,null,null,null,null,null,null,null,null,null,null,null,null,null,null,null,null,{"$f":"Juli!U46","v":"Übersicht über den Arbeitsstundenstand  \"Arbeitsfeld I und II\" laufender Monat"}]
[null,null,null,null,null,null,null,null,null,null,null,null,null,null,null,null,null,null,null,null,{"$f":"U4","v":1287},"Stunden",{"$f":"Juli!W47","v":"SOLL-Jahresarbeitszeit"}]
[null,null,null,null,null,null,null,null,null,null,null,null,null,null,null,null,null,null,null,null,{"$f":"U47-U49","v":0},"Stunden",{"$f":"Juli!W48","v":"bereits geleistete AZ am Ende des laufenden Monats "}]
[null,null,null,null,null,null,null,null,null,null,null,null,null,null,null,null,null,null,null,null,{"$f":"W44","v":1287},"Stunden",{"$f":"Juli!W49","v":"noch zu leistende AZ nach Ende des laufenden Monats (Restjahresarbeitszeit)"}]
[null,null,null,null,null,null,null,null,null,null,null,null,null,null,null,null,null,null,null,null,{"$f":"U49/2","v":643.5},"Stunden","Durchschnittliche monatliche Arbeitszeit November-Dezember, um Ende des Jahres ein ausgeglichenes Jahrsarbeitszeitkonto vorzuweisen. "]
[null,null,null,null,null,null,null,null,null,null,null,null,null,null,null,null,null,null,null,null,{"$f":"September!U5/9","v":0},"Stunden",{"$f":"Juli!W51","v":"Durchschnittliche bisherige monatliche Arbeitszeit zum Ende des Vormonats."}]
["1 Spalte O/P: Die SpalteTagesarbeitszeit wird  im MODELL  A ausgefüllt. Dabei ist hier jeweils die Gesamtarbeitszeit pro Tag in einer Summe einzutragen. Eine  Aufteilung in einzelne Arbeitsbereiche wird nur im MODELL B vorgenommen (in Spalte C bis L). \nFür die Darstellung von MODELL A wird über der Spaltenbeschriftung im Kopf (M) auf das Minus geklickt. Überflüssige Spalten werden damit ausgeblendet. (Siehe auch Arbeitshilfe.) Für die Darstellung von MODELL B wird auf das Plus-Zeichen über Spalte O geklickt. "]
["2  Spalte Q: An Urlaubstagen ist immer die Zahl 1 (und nichts anderes) einzutragen. Zusätzlich ist darauf zu achten, dass an Urlaubstagen keine Arbeitszeit ausgefüllt wird. (Sonst würde der Widerspruch in der Tabelle dargestellt, dass an Urlaubstagen gearbeitet wird. Technisch lässt sich diese Fehldarstellung nicht ausschließen, sodass dieser Hinweis selber beachtet werden muss.) ACHTUNG: Weil an Wochendenen  keine Krankheits- und Urlaubstage eingetragen werden dürfen, sind diese Felder gesperrt. An gesetzlichen Feiertagen dürfen ebenfalls keine Urlaubstage eingetragen werden. \nMitarbeitende mit einer 6-Tage-Woche können Krankheits- und Urlaubstage jeweils freitags mit hinzuzählen. Alle anderen Wochentage sind jeweils nur für eine \"1\" freigegeben."]
["3 Spalte R/S: Je Krankheitstag oder/und personenbezogener Freistellung (Freistellung für Krankheit Kinder, Zusatzfreistellungstage z.B. für Kinder und Pflege) mit einer \"1\" angeben. Angerechnet wird zur Arbeitszeit die \"reguläre tägliche AZ im GP- oder Kirchenmusikalischen Dienst\" (Feld R1). ACHTUNG: Weil an Wochendenen  keine Krankheits- und Urlaubstagstage eingetragen werden dürfen, sind diese Felder gesperrt. An gesetzlichen Feiertagen dürfen ebenfalls keine Krankheitstage eingetragen werden. \nMitarbeitende mit einer 6-Tage-Woche können Krankheitstage jeweils freitags mit hinzuzählen (statt eine 1 eine 2 eintragen). Alle anderen Wochentage sind jeweils nur für eine \"1\" freigegeben."]
["4 Spalte T: Hier werden die Arbeitsorte des jeweiligen Tages eingetragen. Wegen der  begrenzten Spaltengröße empfiehlt es sich, eigene Kürzel festzulegen."]
["5 Spalte U, Zeile 4 und 5: JAHR-SOLL entspricht der Jahresplanung; JAHR-IST enthält die tagesaktuelle, schon geleistete AZ in diesem Bereich. "]
["6 Spalte Y: Platz für Anmerkungen.  ACHTUNG: Die Schrift passt sich der Größe des Feldes an. Bei viel Text wird die Schrift sehr klein. Im Bedarfsfall kann im Eingabefeld der Text angeschaut werden. Diese Form ist notwendig, um einen Ausdruck zu ermöglichen."]

{"sheet":"November","index":14,"n_rows":57,"n_cols":26,"rows_kept":57,"cut":false,"hidden":false,"merged":[[46,22,46,24],[47,22,47,24],[48,22,48,24],[43,12,43,13],[44,19,44,24],[45,20,45,24],[40,21,42,21],[40,22,42,22],[42,14,42,15],[43,14,43,15],[24,16,25,18],[31,16,32,18],[38,16,39,18],[39,14,39,15],[36,14,36,15],[37,14,37,15],[55,0,55,24],[56,0,56,24],[49,22,49,24],[50,22,50,24],[51,0,51,24],[52,0,52,24],[53,0,53,24],[54,0,54,24],[43,2,43,3],[43,4,43,5],[43,6,43,7],[43,8,43,9],[43,10,43,11],[40,23,42,23],[41,2,41,3],[41,4,41,5],[41,6,41,7],[41,8,41,9],[42,2,42,3],[42,4,42,5],[41,10,41,11],[41,12,41,13],[41,14,41,15],[42,6,42,7],[42,8,42,9],[42,10,42,11],[42,12,42,13],[40,10,40,11],[40,12,40,13],[40,14,40,15],[39,10,39,11],[38,2,38,3],[38,4,38,5],[40,2,40,3],[40,4,40,5],[40,6,40,7],[40,8,40,9],[39,2,39,3],[39,4,39,5],[39,6,39,7],[39,8,39,9],[39,12,39,13],[38,6,38,7],[38,8,38,9],[38,10,38,11],[38,12,38,13],[38,14,38,15],[33,4,33,5],[36,8,36,9],[36,10,36,11],[37,12,37,13],[37,2,37,3],[37,4,37,5],[37,6,37,7],[36,2,36,3],[36,4,36,5],[36,6,36,7],[34,2,34,3],[34,4,34,5],[34,6,34,7],[34,8,34,9],[34,10,34,11],[33,2,33,3],[33,6,33,7],[35,2,35,3],[35,4,35,5],[35,6,35,7],[33,23,38,23],[34,14,34,15],[35,14,35,15],[37,8,37,9],[37,10,37,11],[33,21,38,21],[33,22,38,22],[36,12,36,13],[35,8,35,9],[35,10,35,11],[33,14,33,15],[33,8,33,9],[33,10,33,11],[33,12,33,13],[35,12,35,13],[34,12,34,13],[32,14,32,15],[31,2,31,3],[31,4,31,5],[31,6,31,7],[31,8,31,9],[31,10,31,11],[31,12,31,13],[32,2,32,3],[32,4,32,5],[32,6,32,7],[32,8,32,9],[32,10,32,11],[32,12,32,13],[30,14,30,15],[31,14,31,15],[29,8,29,9],[29,10,29,11],[29,12,29,13],[30,12,30,13],[28,6,28,7],[30,2,30,3],[30,4,30,5],[30,6,30,7],[29,2,29,3],[29,4,29,5],[29,6,29,7],[28,2,28,3],[28,4,28,5],[28,8,28,9],[28,10,28,11],[26,14,26,15],[27,2,27,3],[27,4,27,5],[27,6,27,7],[29,14,29,15],[25,2,25,3],[25,4,25,5],[25,6,25,7],[26,23,31,23],[27,14,27,15],[28,14,28,15],[30,8,30,9],[30,10,30,11],[28,12,28,13],[26,21,31,21],[25,8,25,9],[25,10,25,11],[25,12,25,13],[27,8,27,9],[27,10,27,11],[25,14,25,15],[26,22,31,22],[27,12,27,13],[26,2,26,3],[26,4,26,5],[26,6,26,7],[26,8,26,9],[26,10,26,11],[26,12,26,13],[23,2,23,3],[23,4,23,5],[23,6,23,7],[22,2,22,3],[22,4,22,5],[22,6,22,7],[24,2,24,3],[24,4,24,5],[24,6,24,7],[19,14,19,15],[19,23,24,23],[20,14,20,15],[21,14,21,15],[23,8,23,9],[23,10,23,11],[21,12,21,13],[19,21,24,21],[19,22,24,22],[20,12,20,13],[20,8,20,9],[20,10,20,11],[21,8,21,9],[21,10,21,11],[22,14,22,15],[23,14,23,15],[24,14,24,15],[22,8,22,9],[22,10,22,11],[22,12,22,13],[23,12,23,13],[24,8,24,9],[24,10,24,11],[24,12,24,13],[21,4,21,5],[21,6,21,7],[18,2,18,3],[18,4,18,5],[18,6,18,7],[18,8,18,9],[18,10,18,11],[18,12,18,13],[17,2,17,3],[17,4,17,5],[19,2,19,3],[19,4,19,5],[19,6,19,7],[19,8,19,9],[19,10,19,11],[19,12,19,13],[20,2,20,3],[20,4,20,5],[20,6,20,7],[21,2,21,3],[15,4,15,5],[15,6,15,7],[17,6,17,7],[17,8,17,9],[15,2,15,3],[12,23,17,23],[13,14,13,15],[14,14,14,15],[16,8,16,9],[16,10,16,11],[12,21,17,21],[12,22,17,22],[14,2,14,3],[14,4,14,5],[14,6,14,7],[16,2,16,3],[16,4,16,5],[16,6,16,7],[12,2,12,3],[12,4,12,5],[12,6,12,7],[12,8,12,9],[13,2,13,3],[13,4,13,5],[18,14,18,15],[17,10,17,11],[17,12,17,13],[15,14,15,15],[17,16,18,18],[13,10,13,11],[14,8,14,9],[14,10,14,11],[16,14,16,15],[17,14,17,15],[15,8,15,9],[15,10,15,11],[15,12,15,13],[14,12,14,13],[13,12,13,13],[16,12,16,13],[13,6,13,7],[13,8,13,9],[12,10,12,11],[12,12,12,13],[12,14,12,15],[11,2,11,3],[11,4,11,5],[11,6,11,7],[11,8,11,9],[11,10,11,11],[11,12,11,13],[11,14,11,15],[8,8,8,9],[8,10,8,11],[8,14,8,15],[9,14,9,15],[10,6,10,7],[10,8,10,9],[10,10,10,11],[9,10,9,11],[9,12,9,13],[10,14,10,15],[9,6,9,7],[9,8,9,9],[5,23,10,23],[6,2,6,3],[6,4,6,5],[6,6,6,7],[6,8,6,9],[6,10,6,11],[6,12,6,13],[6,14,6,15],[9,2,9,3],[9,4,9,5],[5,21,10,21],[5,22,10,22],[7,14,7,15],[8,2,8,3],[8,4,8,5],[8,6,8,7],[7,10,7,11],[7,12,7,13],[10,2,10,3],[10,4,10,5],[10,16,11,18],[5,14,5,15],[8,12,8,13],[10,12,10,13],[4,0,4,1],[4,2,4,3],[4,4,4,5],[4,6,4,7],[4,8,4,9],[4,10,4,11],[7,6,7,7],[7,8,7,9],[4,12,4,13],[4,14,4,15],[5,2,5,3],[5,4,5,5],[5,6,5,7],[5,8,5,9],[5,10,5,11],[5,12,5,13],[7,2,7,3],[7,4,7,5],[3,0,3,1],[3,2,3,3],[3,4,3,5],[3,6,3,7],[3,8,3,9],[3,10,3,11],[3,12,3,13],[3,14,3,15],[2,2,2,3],[0,21,0,25],[1,21,1,25],[0,0,0,11],[0,14,0,16],[0,17,0,18],[2,17,2,18],[1,0,1,13],[2,4,2,5],[2,6,2,7],[2,8,2,9],[2,10,2,11],[2,12,2,13]]}
[{"$f":"Stammdaten!B3","v":0},null,null,null,null,null,null,null,null,null,null,null,null,null,{"$f":"Januar!O1","v":"reguläre tägliche AZ im GP-Dienst/ Kirchenmusik (Stunden)"},null,null,{"$f":"Stammdaten!B31","v":5.85},null,{"$f":"Januar!T1","v":"SOLL-AZ  im GP/KM-Dienst (Stunden)"},{"$f":"Stammdaten!B26","v":1287},"NOVEMBER"]
[null,null,null,null,null,null,null,null,null,null,null,null,null,null,"a)  Angaben in Stunden (Bsp. 1,00=60min; 1,5=90min; 0,75=45min; 0,25=15min)",null,null,null,null,null,null,{"$f":"Januar!V2","v":"b)  Die Felder in dieser Farbe werden automatisch ausgefüllt."}]
[null,"Tag",{"$f":"'2023'!B6","v":"1) Regelmäßige Veranstaltungen "},null,{"$f":"'2023'!C6","v":"2) Einzelveranstaltungen, Projekte, Freizeiten, besondere Dienste "},null,{"$f":"'2023'!D6","v":"3) Gremien, Konvente"},null,{"$f":"'2023'!E6","v":"4) Sonstige Dienstpflichten "},null,{"$f":"'2023'!F6","v":"5) Entwicklung neuer Arbeitsansätze / Unvorhersehbares / seelsorgerische Begleitung Einzelner"},null,{"$f":"'2023'!G6","v":"6) sonstige Arbeitsfelder (z.B. Kirchenmusik) "},null,{"$f":"'2023'!H6","v":"Tagesarbeitszeit"},"siehe 1","Urlaub - Tag je als 1 eintragen  2","Krankheit und weitere personenbezogene  Freistellungen - Tag je als \"1\" eintragen 3",null,"Ort 4","geleistete AZ 5","geleistete Wochenstunden","Restarbeitszeit Jahr","verbleibende AZ im Jahr in Prozent","Anmerkung / Hinweis / Begründung 6",{"$f":"Januar!Z3","v":"Plausibilitätsprüfung "}]
["JAHR-SOLL",null,{"$f":"Stammdaten!B34","v":0},null,{"$f":"Stammdaten!B35","v":0},null,{"$f":"Stammdaten!B36","v":0},null,{"$f":"Stammdaten!B37","v":0},null,{"$f":"Stammdaten!B38","v":0},null,{"$f":"Stammdaten!B39","v":0},null,{"$f":"Stammdaten!B26","v":1287},null,{"$f":"Stammdaten!B7","v":30},"Tag 3"," Umrechnung in Stunden",null,{"$f":"Stammdaten!B26","v":1287}]
["JAHR-IST",null,{"$f":"'2023'!B8","v":0},null,{"$f":"'2023'!C8","v":0},null,{"$f":"'2023'!D8","v":0},null,{"$f":"'2023'!E8","v":0},null,{"$f":"'2023'!F8","v":0},null,{"$f":"'2023'!G8","v":0},null,{"$f":"'2023'!H8","v":0},null,{"$f":"Oktober!Q5-November!Q45","v":30},null,{"$f":"SUM(S6:S44)","v":0},null,{"$f":"U4-W44","v":0}]
[null,"Mo",null,null,null,null,null,null,null,null,null,null,null,null,null,null,null,null,{"$f":"IF(R6=INTERN!$A$4,$R$1,\"0\")","v":"0"},null,{"$f":"SUM(C6:O6)+S6","v":0},null,null,null,null,{"$f":"IF(OR(AND(OR(C6<>\"\",E6<>\"\",G6<>\"\",I6<>\"\",K6<>\"\",M6<>\"\",O6<>\"\"),Q6<>\"\"),AND(OR(C6<>\"\",E6<>\"\",G6<>\"\",I6<>\"\",K6<>\"\",M6<>\"\",O6<>\"\"),R6<>\"\"),AND(Q6<>\"\",R6<>\"\")),\"Fehler\",\"\")","v":""}]
[null,"Die",null,null,null,null,null,null,null,null,null,null,null,null,null,null,null,null,{"$f":"IF(R7=INTERN!$A$4,$R$1,\"0\")","v":"0"},null,{"$f":"SUM(C7:O7)+S7","v":0},null,null,null,null,{"$f":"IF(OR(AND(OR(C7<>\"\",E7<>\"\",G7<>\"\",I7<>\"\",K7<>\"\",M7<>\"\",O7<>\"\"),Q7<>\"\"),AND(OR(C7<>\"\",E7<>\"\",G7<>\"\",I7<>\"\",K7<>\"\",M7<>\"\",O7<>\"\"),R7<>\"\"),AND(Q7<>\"\",R7<>\"\")),\"Fehler\",\"\")","v":""}]
["1.11.","Mi",null,null,null,null,null,null,null,null,null,null,null,null,null,null,null,null,{"$f":"IF(R8=INTERN!$A$4,$R$1,\"0\")","v":"0"},null,0,null,null,null,null,""]
["2.11.","Do",null,null,null,null,null,null,null,null,null,null,null,null,null,null,null,null,{"$f":"IF(R9=INTERN!$A$4,$R$1,\"0\")","v":"0"},null,0,null,null,null,null,""]
["3.11.","Fr",null,null,null,null,null,null,null,null,null,null,null,null,null,null,null,null,{"$f":"R10*R1","v":0},null,0,null,null,null,null,""]
["4.11.","Sa",null,null,null,null,null,null,null,null,null,null,null,null,null,null,null,null,null,null,{"$f":"SUM(C11:O11)","v":0},null,null,null,null,""]
["5.11.","So",null,null,null,null,null,null,null,null,null,null,null,null,null,null,null,null,null,null,{"$f":"SUM(C12:O12)","v":0},{"$f":"SUM(U6:U12)","v":0},{"$f":"Oktober!W44-November!V12","v":1287},{"$f":"(W12*100)/U1","v":100},null,""]
["6.11.","Mo",null,null,null,null,null,null,null,null,null,null,null,null,null,null,null,null,{"$f":"IF(R13=INTERN!$A$4,$R$1,\"0\")","v":"0"},null,0,null,null,null,null,""]
["7.11.","Die",null,null,null,null,null,null,null,null,null,null,null,null,null,null,null,null,{"$f":"IF(R14=INTERN!$A$4,$R$1,\"0\")","v":"0"},null,0,null,null,null,null,""]
["8.11.","Mi",null,null,null,null,null,null,null,null,null,null,null,null,null,null,null,null,{"$f":"IF(R15=INTERN!$A$4,$R$1,\"0\")","v":"0"},null,0,null,null,null,null,""]
["9.11.","Do",null,null,null,null,null,null,null,null,null,null,null,null,null,null,null,null,{"$f":"IF(R16=INTERN!$A$4,$R$1,\"0\")","v":"0"},null,0,null,null,null,null,""]
["10.11.","Fr",null,null,null,null,null,null,null,null,null,null,null,null,null,null,null,null,{"$f":"R17*R1","v":0},null,0,null,null,null,null,""]
["11.11.","Sa",null,null,null,null,null,null,null,null,null,null,null,null,null,null,null,null,null,null,{"$f":"SUM(C18:O18)","v":0},null,null,null,null,""]
["12.11.","So",null,null,null,null,null,null,null,null,null,null,null,null,null,null,null,null,null,null,{"$f":"SUM(C19:O19)","v":0},{"$f":"SUM(U13:U19)","v":0},{"$f":"W12-V19","v":1287},{"$f":"(W19*100)/U1","v":100},null,""]
["13.11.","Mo",null,null,null,null,null,null,null,null,null,null,null,null,null,null,null,null,{"$f":"IF(R20=INTERN!$A$4,$R$1,\"0\")","v":"0"},null,0," ",null,null,null,""]
["14.11.","Die",null,null,null,null,null,null,null,null,null,null,null,null,null,null,null,null,{"$f":"IF(R21=INTERN!$A$4,$R$1,\"0\")","v":"0"},null,0,null,null,null,null,""]
["15.11.","Mi",null,null,null,null,null,null,null,null,null,null,null,null,null,null,null,null,{"$f":"IF(R22=INTERN!$A$4,$R$1,\"0\")","v":"0"},null,0,null,null,null,null,""]
["16.11.","Do",null,null,null,null,null,null,null,null,null,null,null,null,null,null,null,null,{"$f":"IF(R23=INTERN!$A$4,$R$1,\"0\")","v":"0"},null,0,null,null,null,null,""]
["17.11.","Fr",null,null,null,null,null,null,null,null,null,null,null,null,null,null,null,null,{"$f":"R24*R1","v":0},null,0,null,null,null,null,""]
["18.11.","Sa",null,null,null,null,null,null,null,null,null,null,null,null,null,null,null,null,null,null,{"$f":"SUM(C25:O25)","v":0},null,null,null,null,""]
["19.11.","So",null,null,null,null,null,null,null,null,null,null,null,null,null,null,null,null,null,null,{"$f":"SUM(C26:O26)","v":0},{"$f":"SUM(U20:U26)","v":0},{"$f":"W19-V26","v":1287},{"$f":"(W26*100)/U1","v":100},null,""]
["20.11.","Mo",null,null,null,null,null,null,null,null,null,null,null,null,null,null,null,null,{"$f":"IF(R27=INTERN!$A$4,$R$1,\"0\")","v":"0"},null,0,null,null,null,null,""]
["21.11.","Die",null,null,null,null,null,null,null,null,null,null,null,null,null,null,null,null,{"$f":"IF(R28=INTERN!$A$4,$R$1,\"0\")","v":"0"},null,0,null,null,null,null,""]
["22.11.","Mi",null,null,null,null,null,null,null,null,null,null,null,null,null,null,null,null,{"$f":"IF(R29=INTERN!$A$4,$R$1,\"0\")","v":"0"},null,0,null,null,null,null,""]
["23.11.","Do",null,null,null,null,null,null,null,null,null,null,null,null,null,null,null,null,{"$f":"IF(R30=INTERN!$A$4,$R$1,\"0\")","v":"0"},null,0,null,null,null,null,""]
["24.11.","Fr",null,null,null,null,null,null,null,null,null,null,null,null,null,null,null,null,{"$f":"R31*R1","v":0},null,0,null,null,null,null,""]
["25.11.","Sa",null,null,null,null,null,null,null,null,null,null,null,null,null,null,null,null,null,null,{"$f":"SUM(C32:O32)","v":0},null,null,null,null,""]
["26.11.","So",null,null,null,null,null,null,null,null,null,null,null,null,null,null,null,null,null,null,{"$f":"SUM(C33:O33)","v":0},{"$f":"SUM(U27:U33)","v":0},{"$f":"W26-V33","v":1287},{"$f":"(W33*100)/U1","v":100},null,{"$f":"IF(OR(AND(OR(C33<>\"\",E33<>\"\",G33<>\"\",I33<>\"\",K33<>\"\",M33<>\"\",O33<>\"\"),Q33<>\"\"),AND(OR(C33<>\"\",E33<>\"\",G33<>\"\",I33<>\"\",K33<>\"\",M33<>\"\",O33<>\"\"),R33<>\"\"),AND(Q33<>\"\",R33<>\"\")),\"Fehler\",\"\")","v":""}]
["27.11.","Mo",null,null,null,null,null,null,null,null,null,null,null,null,null,null,null,null,{"$f":"IF(R34=INTERN!$A$4,$R$1,\"0\")","v":"0"},null,0,null,null,null,null,""]
["28.11.","Die",null,null,null,null,null,null,null,null,null,null,null,null,null,null,null,null,{"$f":"IF(R35=INTERN!$A$4,$R$1,\"0\")","v":"0"},null,0,null,null,null,null,""]
["29.11.","Mi",null,null,null,null,null,null,null,null,null,null,null,null,null,null,null,null,{"$f":"IF(R36=INTERN!$A$4,$R$1,\"0\")","v":"0"},null,0,null,null,null,null,""]
["30.11.","Do",null,null,null,null,null,null,null,null,null,null,null,null,null,null,null,null,{"$f":"IF(R37=INTERN!$A$4,$R$1,\"0\")","v":"0"},null,0,null,null,null,null,""]
[null,"Fr",null,null,null,null,null,null,null,null,null,null,null,null,null,null,null,null,{"$f":"R38*R1","v":0},null,0,null,null,null,null,""]
[null,"Sa",null,null,null,null,null,null,null,null,null,null,null,null,null,null,null,null,null,null,{"$f":"SUM(C39:O39)","v":0},null,null,null,null,""]
[null,"So",null,null,null,null,null,null,null,null,null,null,null,null,null,null,null,null,null,null,{"$f":"SUM(C40:O40)","v":0},{"$f":"SUM(U34:U40)","v":0},{"$f":"W33-V40","v":1287},{"$f":"(W40*100)/U1","v":100},null,""]
[null,"Mo",null,null,null,null,null,null,null,null,null,null,null,null,null,null,null,null,{"$f":"IF(R41=INTERN!$A$4,$R$1,\"0\")","v":"0"},null,0,null,null,null,null,""]
[null,"Di",null,null,null,null,null,null,null,null,null,null,null,null,null,null,null,null,{"$f":"IF(R42=INTERN!$A$4,$R$1,\"0\")","v":"0"},null,0,null,null,null,null,""]
[null,"Mi",null,null,null,null,null,null,null,null,null,null,null,null,null,null,null,null,{"$f":"IF(R43=INTERN!$A$4,$R$1,\"0\")","v":"0"},null,0,null,null,null,null,""]
[null,"Do",null,null,null,null,null,null,null,null,null,null,null,null,null,null,null,null,{"$f":"IF(R44=INTERN!$A$4,$R$1,\"0\")","v":"0"},null,0,{"$f":"SUM(U41:U44)","v":0},{"$f":"W40-V44","v":1287},{"$f":"(W44*100)/U1","v":100},null,""]
[null,null,"gesamt",{"$f":"SUM(C6:D44)","v":0},"gesamt",{"$f":"SUM(E6:F44)","v":0},"gesamt",{"$f":"SUM(G6:G44)","v":0},"gesamt",{"$f":"SUM(I6:J44)","v":0},"gesamt",{"$f":"SUM(K6:L44)","v":0},"gesamt",{"$f":"SUM(M6:N44)","v":0},"gesamt",{"$f":"SUM(O6:P44)","v":0},{"$f":"SUM(Q6:Q44)","v":0},null,{"$f":"SUM(S6:S44)","v":0},"AUSDRUCK-ÜBERSICHT"]
[null,null,null,null,null,null,null,null,null,null,null,null,null,null,null,null,null,null,null,null,{"$f":"Juli!U46","v":"Übersicht über den Arbeitsstundenstand  \"Arbeitsfeld I und II\" laufender Monat"}]
[null,null,null,null,null,null,null,null,null,null,null,null,null,null,null,null,null,null,null,null,{"$f":"U4","v":1287},"Stunden",{"$f":"Juli!W47","v":"SOLL-Jahresarbeitszeit"}]
[null,null,null,null,null,null,null,null,null,null,null,null,null,null,null,null,null,null,null,null,{"$f":"U47-U49","v":0},"Stunden",{"$f":"Juli!W48","v":"bereits geleistete AZ am Ende des laufenden Monats "}]
[null,null,null,null,null,null,null,null,null,null,null,null,null,null,null,null,null,null,null,null,{"$f":"W44","v":1287},"Stunden",{"$f":"Juli!W49","v":"noch zu leistende AZ nach Ende des laufenden Monats (Restjahresarbeitszeit)"}]
[null,null,null,null,null,null,null,null,null,null,null,null,null,null,null,null,null,null,null,null,{"$f":"U49","v":1287},"Stunden","Durchschnittliche monatliche Arbeitszeit Dezember, um Ende des Jahres ein ausgeglichenes Jahrsarbeitszeitkonto vorzuweisen. "]
[null,null,null,null,null,null,null,null,null,null,null,null,null,null,null,null,null,null,null,null,{"$f":"Oktober!U5/10","v":0},"Stunden",{"$f":"Juli!W51","v":"Durchschnittliche bisherige monatliche Arbeitszeit zum Ende des Vormonats."}]
["1 Spalte O/P: Die SpalteTagesarbeitszeit wird  im MODELL  A ausgefüllt. Dabei ist hier jeweils die Gesamtarbeitszeit pro Tag in einer Summe einzutragen. Eine  Aufteilung in einzelne Arbeitsbereiche wird nur im MODELL B vorgenommen (in Spalte C bis L). \nFür die Darstellung von MODELL A wird über der Spaltenbeschriftung im Kopf (M) auf das Minus geklickt. Überflüssige Spalten werden damit ausgeblendet. (Siehe auch Arbeitshilfe.) Für die Darstellung von MODELL B wird auf das Plus-Zeichen über Spalte O geklickt. "]
["2  Spalte Q: An Urlaubstagen ist immer die Zahl 1 (und nichts anderes) einzutragen. Zusätzlich ist darauf zu achten, dass an Urlaubstagen keine Arbeitszeit ausgefüllt wird. (Sonst würde der Widerspruch in der Tabelle dargestellt, dass an Urlaubstagen gearbeitet wird. Technisch lässt sich diese Fehldarstellung nicht ausschließen, sodass dieser Hinweis selber beachtet werden muss.) ACHTUNG: Weil an Wochendenen  keine Krankheits- und Urlaubstage eingetragen werden dürfen, sind diese Felder gesperrt. An gesetzlichen Feiertagen dürfen ebenfalls keine Urlaubstage eingetragen werden. \nMitarbeitende mit einer 6-Tage-Woche können Krankheits- und Urlaubstage jeweils freitags mit hinzuzählen. Alle anderen Wochentage sind jeweils nur für eine \"1\" freigegeben."]
["3 Spalte R/S: Je Krankheitstag oder/und personenbezogener Freistellung (Freistellung für Krankheit Kinder, Zusatzfreistellungstage z.B. für Kinder und Pflege) mit einer \"1\" angeben. Angerechnet wird zur Arbeitszeit die \"reguläre tägliche AZ im GP- oder Kirchenmusikalischen Dienst\" (Feld R1). ACHTUNG: Weil an Wochendenen  keine Krankheits- und Urlaubstagstage eingetragen werden dürfen, sind diese Felder gesperrt. An gesetzlichen Feiertagen dürfen ebenfalls keine Krankheitstage eingetragen werden. \nMitarbeitende mit einer 6-Tage-Woche können Krankheitstage jeweils freitags mit hinzuzählen (statt eine 1 eine 2 eintragen). Alle anderen Wochentage sind jeweils nur für eine \"1\" freigegeben."]
["4 Spalte T: Hier werden die Arbeitsorte des jeweiligen Tages eingetragen. Wegen der  begrenzten Spaltengröße empfiehlt es sich, eigene Kürzel festzulegen."]
["5 Spalte U, Zeile 4 und 5: JAHR-SOLL entspricht der Jahresplanung; JAHR-IST enthält die tagesaktuelle, schon geleistete AZ in diesem Bereich. "]
["6 Spalte Y: Platz für Anmerkungen.  ACHTUNG: Die Schrift passt sich der Größe des Feldes an. Bei viel Text wird die Schrift sehr klein. Im Bedarfsfall kann im Eingabefeld der Text angeschaut werden. Diese Form ist notwendig, um einen Ausdruck zu ermöglichen."]

{"sheet":"Dezember","index":15,"n_rows":56,"n_cols":26,"rows_kept":56,"cut":false,"hidden":false,"merged":[[1,0,1,13],[2,2,2,3],[2,4,2,5],[2,6,2,7],[2,8,2,9],[0,0,0,11],[0,14,0,16],[0,17,0,18],[3,0,3,1],[3,2,3,3],[2,17,2,18],[2,10,2,11],[2,12,2,13],[3,4,3,5],[3,6,3,7],[3,8,3,9],[3,10,3,11],[3,12,3,13],[3,14,3,15],[4,0,4,1],[4,2,4,3],[4,4,4,5],[4,6,4,7],[4,8,4,9],[4,10,4,11],[4,12,4,13],[4,14,4,15],[5,2,5,3],[5,4,5,5],[5,6,5,7],[5,8,5,9],[5,10,5,11],[5,12,5,13],[5,14,5,15],[5,21,10,21],[5,22,10,22],[5,23,10,23],[6,2,6,3],[6,4,6,5],[6,6,6,7],[6,8,6,9],[6,10,6,11],[6,12,6,13],[6,14,6,15],[10,16,11,18],[7,14,7,15],[8,14,8,15],[8,2,8,3],[8,4,8,5],[8,6,8,7],[8,8,8,9],[8,10,8,11],[8,12,8,13],[7,2,7,3],[7,4,7,5],[7,6,7,7],[7,8,7,9],[7,10,7,11],[7,12,7,13],[11,2,11,3],[11,4,11,5],[11,6,11,7],[11,8,11,9],[11,10,11,11],[11,12,11,13],[11,14,11,15],[9,14,9,15],[10,2,10,3],[10,4,10,5],[10,6,10,7],[10,8,10,9],[10,10,10,11],[10,12,10,13],[10,14,10,15],[9,2,9,3],[9,4,9,5],[9,6,9,7],[9,8,9,9],[9,10,9,11],[9,12,9,13],[12,14,12,15],[12,21,17,21],[12,22,17,22],[12,23,17,23],[13,2,13,3],[13,4,13,5],[13,6,13,7],[13,8,13,9],[13,10,13,11],[13,12,13,13],[12,2,12,3],[12,4,12,5],[12,6,12,7],[12,8,12,9],[12,10,12,11],[12,12,12,13],[17,16,18,18],[13,14,13,15],[14,14,14,15],[15,14,15,15],[14,2,14,3],[14,4,14,5],[14,6,14,7],[14,8,14,9],[14,10,14,11],[14,12,14,13],[15,2,15,3],[18,14,18,15],[17,2,17,3],[17,4,17,5],[17,6,17,7],[17,8,17,9],[17,10,17,11],[17,12,17,13],[18,2,18,3],[18,4,18,5],[16,14,16,15],[17,14,17,15],[16,2,16,3],[16,4,16,5],[16,6,16,7],[16,8,16,9],[16,10,16,11],[16,12,16,13],[15,4,15,5],[15,6,15,7],[15,8,15,9],[15,10,15,11],[15,12,15,13],[18,6,18,7],[18,8,18,9],[18,10,18,11],[18,12,18,13],[19,2,19,3],[19,4,19,5],[19,6,19,7],[19,8,19,9],[19,10,19,11],[19,12,19,13],[19,14,19,15],[19,21,24,21],[19,22,24,22],[19,23,24,23],[20,2,20,3],[20,4,20,5],[20,6,20,7],[20,8,20,9],[20,10,20,11],[20,12,20,13],[24,16,25,18],[20,14,20,15],[21,14,21,15],[22,14,22,15],[21,2,21,3],[21,4,21,5],[21,6,21,7],[21,8,21,9],[21,10,21,11],[21,12,21,13],[22,2,22,3],[25,14,25,15],[24,2,24,3],[24,4,24,5],[25,2,25,3],[25,4,25,5],[23,14,23,15],[24,14,24,15],[23,2,23,3],[23,4,23,5],[23,6,23,7],[23,8,23,9],[23,10,23,11],[23,12,23,13],[22,4,22,5],[22,6,22,7],[22,8,22,9],[22,10,22,11],[22,12,22,13],[25,6,25,7],[25,8,25,9],[25,10,25,11],[25,12,25,13],[24,6,24,7],[24,8,24,9],[24,10,24,11],[24,12,24,13],[26,2,26,3],[26,4,26,5],[26,6,26,7],[26,8,26,9],[26,10,26,11],[26,12,26,13],[26,14,26,15],[26,21,31,21],[26,22,31,22],[31,12,31,13],[29,4,29,5],[29,6,29,7],[29,8,29,9],[29,10,29,11],[29,12,29,13],[30,14,30,15],[31,14,31,15],[30,2,30,3],[30,4,30,5],[30,6,30,7],[30,8,30,9],[30,10,30,11],[30,12,30,13],[26,23,31,23],[27,2,27,3],[27,4,27,5],[27,6,27,7],[27,8,27,9],[27,10,27,11],[27,12,27,13],[31,16,32,18],[27,14,27,15],[28,14,28,15],[29,14,29,15],[28,2,28,3],[28,4,28,5],[28,6,28,7],[28,8,28,9],[28,10,28,11],[28,12,28,13],[29,2,29,3],[32,14,32,15],[31,2,31,3],[31,4,31,5],[31,6,31,7],[31,8,31,9],[31,10,31,11],[33,21,38,21],[33,22,38,22],[38,12,38,13],[36,4,36,5],[36,6,36,7],[36,8,36,9],[36,10,36,11],[36,12,36,13],[37,12,37,13],[33,12,33,13],[33,14,33,15],[37,14,37,15],[38,14,38,15],[38,2,38,3],[38,4,38,5],[38,6,38,7],[38,8,38,9],[38,10,38,11],[32,6,32,7],[32,8,32,9],[32,10,32,11],[32,12,32,13],[0,21,0,25],[1,21,1,25],[40,14,40,15],[33,23,38,23],[34,2,34,3],[34,4,34,5],[34,6,34,7],[34,8,34,9],[34,10,34,11],[34,12,34,13],[38,16,39,18],[34,14,34,15],[35,14,35,15],[36,14,36,15],[35,2,35,3],[35,4,35,5],[35,6,35,7],[35,8,35,9],[35,10,35,11],[37,2,37,3],[37,4,37,5],[37,6,37,7],[37,8,37,9],[37,10,37,11],[39,12,39,13],[32,2,32,3],[32,4,32,5],[35,12,35,13],[36,2,36,3],[41,8,41,9],[41,10,41,11],[39,6,39,7],[39,8,39,9],[39,10,39,11],[40,2,40,3],[40,4,40,5],[40,6,40,7],[40,8,40,9],[40,10,40,11],[40,12,40,13],[39,2,39,3],[39,4,39,5],[41,6,41,7],[33,2,33,3],[33,4,33,5],[33,6,33,7],[33,8,33,9],[33,10,33,11],[54,0,54,24],[43,14,43,15],[44,19,44,24],[45,20,45,24],[46,22,46,24],[42,6,42,7],[42,8,42,9],[42,10,42,11],[42,12,42,13],[42,14,42,15],[39,14,39,15],[55,0,55,24],[49,22,49,24],[50,0,50,24],[51,0,51,24],[52,0,52,24],[53,0,53,24],[42,2,42,3],[42,4,42,5],[47,22,47,24],[48,22,48,24],[43,2,43,3],[43,4,43,5],[43,6,43,7],[43,8,43,9],[43,10,43,11],[43,12,43,13],[40,22,42,22],[40,23,42,23],[41,14,41,15],[41,12,41,13],[40,21,42,21],[41,2,41,3],[41,4,41,5]]}
[{"$f":"Stammdaten!B3","v":0},null,null,null,null,null,null,null,null,null,null,null,null,null,{"$f":"Januar!O1","v":"reguläre tägliche AZ im GP-Dienst/ Kirchenmusik (Stunden)"},null,null,{"$f":"Stammdaten!B31","v":5.85},null,{"$f":"Januar!T1","v":"SOLL-AZ  im GP/KM-Dienst (Stunden)"},{"$f":"Stammdaten!B26","v":1287},"DEZEMBER"]
[null,null,null,null,null,null,null,null,null,null,null,null,null,null,"a)  Angaben in Stunden (Bsp. 1,00=60min; 1,5=90min; 0,75=45min; 0,25=15min)",null,null,null,null,null,null,{"$f":"Januar!V2","v":"b)  Die Felder in dieser Farbe werden automatisch ausgefüllt."}]
[null,"Tag",{"$f":"'2023'!B6","v":"1) Regelmäßige Veranstaltungen "},null,{"$f":"'2023'!C6","v":"2) Einzelveranstaltungen, Projekte, Freizeiten, besondere Dienste "},null,{"$f":"'2023'!D6","v":"3) Gremien, Konvente"},null,{"$f":"'2023'!E6","v":"4) Sonstige Dienstpflichten "},null,{"$f":"'2023'!F6","v":"5) Entwicklung neuer Arbeitsansätze / Unvorhersehbares / seelsorgerische Begleitung Einzelner"},null,{"$f":"'2023'!G6","v":"6) sonstige Arbeitsfelder (z.B. Kirchenmusik) "},null,{"$f":"'2023'!H6","v":"Tagesarbeitszeit"},"siehe 1","Urlaub - Tag je als 1 eintragen  2","Krankheit und weitere personenbezogene  Freistellungen - Tag je als \"1\" eintragen 3",null,"Ort 4","geleistete AZ 5","geleistete Wochenstunden","Restarbeitszeit Jahr","verbleibende AZ im Jahr in Prozent","Anmerkung / Hinweis / Begründung 6",{"$f":"Januar!Z3","v":"Plausibilitätsprüfung "}]
["JAHR-SOLL",null,{"$f":"Stammdaten!B34","v":0},null,{"$f":"Stammdaten!B35","v":0},null,{"$f":"Stammdaten!B36","v":0},null,{"$f":"Stammdaten!B37","v":0},null,{"$f":"Stammdaten!B38","v":0},null,{"$f":"Stammdaten!B39","v":0},null,{"$f":"Stammdaten!B26","v":1287},null,{"$f":"Stammdaten!B7","v":30},"Tag 3"," Umrechnung in Stunden",null,{"$f":"Stammdaten!B26","v":1287}]
["JAHR-IST",null,{"$f":"'2023'!B8","v":0},null,{"$f":"'2023'!C8","v":0},null,{"$f":"'2023'!D8","v":0},null,{"$f":"'2023'!E8","v":0},null,{"$f":"'2023'!F8","v":0},null,{"$f":"'2023'!G8","v":0},null,{"$f":"'2023'!H8","v":0},null,{"$f":"November!Q5-Dezember!Q45","v":30},null,{"$f":"SUM(S6:S44)","v":0},null,{"$f":"U4-W44","v":0}]
[null,"Mo",null,null,null,null,null,null,null,null,null,null,null,null,null,null,null,null,{"$f":"IF(R6=INTERN!$A$4,$R$1,\"0\")","v":"0"},null,{"$f":"SUM(C6:O6)+S6","v":0},null,null,null,null,{"$f":"IF(OR(AND(OR(C6<>\"\",E6<>\"\",G6<>\"\",I6<>\"\",K6<>\"\",M6<>\"\",O6<>\"\"),Q6<>\"\"),AND(OR(C6<>\"\",E6<>\"\",G6<>\"\",I6<>\"\",K6<>\"\",M6<>\"\",O6<>\"\"),R6<>\"\"),AND(Q6<>\"\",R6<>\"\")),\"Fehler\",\"\")","v":""}]
[null,"Die",null,null,null,null,null,null,null,null,null,null,null,null,null,null,null,null,{"$f":"IF(R7=INTERN!$A$4,$R$1,\"0\")","v":"0"},null,{"$f":"SUM(C7:O7)+S7","v":0},null,null,null,null,{"$f":"IF(OR(AND(OR(C7<>\"\",E7<>\"\",G7<>\"\",I7<>\"\",K7<>\"\",M7<>\"\",O7<>\"\"),Q7<>\"\"),AND(OR(C7<>\"\",E7<>\"\",G7<>\"\",I7<>\"\",K7<>\"\",M7<>\"\",O7<>\"\"),R7<>\"\"),AND(Q7<>\"\",R7<>\"\")),\"Fehler\",\"\")","v":""}]
[null,"Mi",null,null,null,null,null,null,null,null,null,null,null,null,null,null,null,null,{"$f":"IF(R8=INTERN!$A$4,$R$1,\"0\")","v":"0"},null,0,null,null,null,null,""]
[null,"Do",null,null,null,null,null,null,null,null,null,null,null,null,null,null,null,null,{"$f":"IF(R9=INTERN!$A$4,$R$1,\"0\")","v":"0"},null,0,null,null,null,null,""]
["1.12.","Fr",null,null,null,null,null,null,null,null,null,null,null,null,null,null,null,null,{"$f":"R10*R1","v":0},null,0,null,null,null,null,""]
["2.12.","Sa",null,null,null,null,null,null,null,null,null,null,null,null,null,null,null,null,null,null,{"$f":"SUM(C11:O11)","v":0},null,null,null,null,""]
["3.12.","So",null,null,null,null,null,null,null,null,null,null,null,null,null,null,null,null,null,null,{"$f":"SUM(C12:O12)","v":0},{"$f":"SUM(U6:U12)","v":0},{"$f":"November!W44-Dezember!V12","v":1287},{"$f":"(W12*100)/U1","v":100},null,""]
["4.12.","Mo",null,null,null,null,null,null,null,null,null,null,null,null,null,null,null,null,{"$f":"IF(R13=INTERN!$A$4,$R$1,\"0\")","v":"0"},null,0,null,null,null,null,""]
["5.12.","Die",null,null,null,null,null,null,null,null,null,null,null,null,null,null,null,null,{"$f":"IF(R14=INTERN!$A$4,$R$1,\"0\")","v":"0"},null,0,null,null,null,null,""]
["6.12.","Mi",null,null,null,null,null,null,null,null,null,null,null,null,null,null,null,null,{"$f":"IF(R15=INTERN!$A$4,$R$1,\"0\")","v":"0"},null,0,null,null,null,null,""]
["7.12.","Do",null,null,null,null,null,null,null,null,null,null,null,null,null,null,null,null,{"$f":"IF(R16=INTERN!$A$4,$R$1,\"0\")","v":"0"},null,0,null,null,null,null,""]
["8.12.","Fr",null,null,null,null,null,null,null,null,null,null,null,null,null,null,null,null,{"$f":"R17*R1","v":0},null,0,null,null,null,null,""]
["9.12.","Sa",null,null,null,null,null,null,null,null,null,null,null,null,null,null,null,null,null,null,{"$f":"SUM(C18:O18)","v":0},null,null,null,null,""]
["10.12.","So",null,null,null,null,null,null,null,null,null,null,null,null,null,null,null,null,null,null,{"$f":"SUM(C19:O19)","v":0},{"$f":"SUM(U13:U19)","v":0},{"$f":"W12-V19","v":1287},{"$f":"(W19*100)/U1","v":100},null,""]
["11.12.","Mo",null,null,null,null,null,null,null,null,null,null,null,null,null,null,null,null,{"$f":"IF(R20=INTERN!$A$4,$R$1,\"0\")","v":"0"},null,0," ",null,null,null,""]
["12.12.","Die",null,null,null,null,null,null,null,null,null,null,null,null,null,null,null,null,{"$f":"IF(R21=INTERN!$A$4,$R$1,\"0\")","v":"0"},null,0,null,null,null,null,""]
["13.12.","Mi",null,null,null,null,null,null,null,null,null,null,null,null,null,null,null,null,{"$f":"IF(R22=INTERN!$A$4,$R$1,\"0\")","v":"0"},null,0,null,null,null,null,""]
["14.12.","Do",null,null,null,null,null,null,null,null,null,null,null,null,null,null,null,null,{"$f":"IF(R23=INTERN!$A$4,$R$1,\"0\")","v":"0"},null,0,null,null,null,null,""]
["15.12.","Fr",null,null,null,null,null,null,null,null,null,null,null,null,null,null,null,null,{"$f":"R24*R1","v":0},null,0,null,null,null,null,""]
["16.12.","Sa",null,null,null,null,null,null,null,null,null,null,null,null,null,null,null,null,null,null,{"$f":"SUM(C25:O25)","v":0},null,null,null,null,""]
["17.12.","So",null,null,null,null,null,null,null,null,null,null,null,null,null,null,null,null,null,null,{"$f":"SUM(C26:O26)","v":0},{"$f":"SUM(U20:U26)","v":0},{"$f":"W19-V26","v":1287},{"$f":"(W26*100)/U1","v":100},null,""]
["18.12.","Mo",null,null,null,null,null,null,null,null,null,null,null,null,null,null,null,null,{"$f":"IF(R27=INTERN!$A$4,$R$1,\"0\")","v":"0"},null,0,null,null,null,null,""]
["19.12.","Die",null,null,null,null,null,null,null,null,null,null,null,null,null,null,null,null,{"$f":"IF(R28=INTERN!$A$4,$R$1,\"0\")","v":"0"},null,0,null,null,null,null,""]
["20.12.","Mi",null,null,null,null,null,null,null,null,null,null,null,null,null,null,null,null,{"$f":"IF(R29=INTERN!$A$4,$R$1,\"0\")","v":"0"},null,0,null,null,null,null,""]
["21.12.","Do",null,null,null,null,null,null,null,null,null,null,null,null,null,null,null,null,{"$f":"IF(R30=INTERN!$A$4,$R$1,\"0\")","v":"0"},null,0,null,null,null,null,""]
["22.12.","Fr",null,null,null,null,null,null,null,null,null,null,null,null,null,null,null,null,{"$f":"R31*R1","v":0},null,0,null,null,null,null,""]
["23.12.","Sa",null,null,null,null,null,null,null,null,null,null,null,null,null,null,null,null,null,null,{"$f":"SUM(C32:O32)","v":0},null,null,null,null,""]
["24.12.","So",null,null,null,null,null,null,null,null,null,null,null,null,null,null,null,null,null,null,{"$f":"SUM(C33:O33)","v":0},{"$f":"SUM(U27:U33)","v":0},{"$f":"W26-V33","v":1287},{"$f":"(W33*100)/U1","v":100},null,{"$f":"IF(OR(AND(OR(C33<>\"\",E33<>\"\",G33<>\"\",I33<>\"\",K33<>\"\",M33<>\"\",O33<>\"\"),Q33<>\"\"),AND(OR(C33<>\"\",E33<>\"\",G33<>\"\",I33<>\"\",K33<>\"\",M33<>\"\",O33<>\"\"),R33<>\"\"),AND(Q33<>\"\",R33<>\"\")),\"Fehler\",\"\")","v":""}]
["25.12.","Mo",null,null,null,null,null,null,null,null,null,null,null,null,null,null,null,null,{"$f":"IF(R34=INTERN!$A$4,$R$1,\"0\")","v":"0"},null,0,null,null,null,null,""]
["26.12.","Die",null,null,null,null,null,null,null,null,null,null,null,null,null,null,null,null,{"$f":"IF(R35=INTERN!$A$4,$R$1,\"0\")","v":"0"},null,0,null,null,null,null,""]
["27.12.","Mi",null,null,null,null,null,null,null,null,null,null,null,null,null,null,null,null,{"$f":"IF(R36=INTERN!$A$4,$R$1,\"0\")","v":"0"},null,0,null,null,null,null,""]
["28.12.","Do",null,null,null,null,null,null,null,null,null,null,null,null,null,null,null,null,{"$f":"IF(R37=INTERN!$A$4,$R$1,\"0\")","v":"0"},null,0,null,null,null,null,""]
["29.12.","Fr",null,null,null,null,null,null,null,null,null,null,null,null,null,null,null,null,{"$f":"R38*R1","v":0},null,0,null,null,null,null,""]
["30.12.","Sa",null,null,null,null,null,null,null,null,null,null,null,null,null,null,null,null,null,null,{"$f":"SUM(C39:O39)","v":0},null,null,null,null,""]
["31.12.","So",null,null,null,null,null,null,null,null,null,null,null,null,null,null,null,null,null,null,{"$f":"SUM(C40:O40)","v":0},{"$f":"SUM(U34:U40)","v":0},{"$f":"W33-V40","v":1287},{"$f":"(W40*100)/U1","v":100},null,""]
[null,"Mo",null,null,null,null,null,null,null,null,null,null,null,null,null,null,null,null,{"$f":"IF(R41=INTERN!$A$4,$R$1,\"0\")","v":"0"},null,0,null,null,null,null,""]
[null,"Di",null,null,null,null,null,null,null,null,null,null,null,null,null,null,null,null,{"$f":"IF(R42=INTERN!$A$4,$R$1,\"0\")","v":"0"},null,0,null,null,null,null,""]
[null,"Mi",null,null,null,null,null,null,null,null,null,null,null,null,null,null,null,null,{"$f":"IF(R43=INTERN!$A$4,$R$1,\"0\")","v":"0"},null,0,null,null,null,null,""]
[null,"Do",null,null,null,null,null,null,null,null,null,null,null,null,null,null,null,null,{"$f":"IF(R44=INTERN!$A$4,$R$1,\"0\")","v":"0"},null,0,{"$f":"SUM(U41:U44)","v":0},{"$f":"W40-V44","v":1287},{"$f":"(W44*100)/U1","v":100},null,""]
[null,null,"gesamt",{"$f":"SUM(C6:D44)","v":0},"gesamt",{"$f":"SUM(E6:F44)","v":0},"gesamt",{"$f":"SUM(G6:G44)","v":0},"gesamt",{"$f":"SUM(I6:J44)","v":0},"gesamt",{"$f":"SUM(K6:L44)","v":0},"gesamt",{"$f":"SUM(M6:N44)","v":0},"gesamt",{"$f":"SUM(O6:P44)","v":0},{"$f":"SUM(Q6:Q44)","v":0},null,{"$f":"SUM(S6:S44)","v":0},"AUSDRUCK-ÜBERSICHT"]
[null,null,null,null,null,null,null,null,null,null,null,null,null,null,null,null,null,null,null,null,{"$f":"Juli!U46","v":"Übersicht über den Arbeitsstundenstand  \"Arbeitsfeld I und II\" laufender Monat"}]
[null,null,null,null,null,null,null,null,null,null,null,null,null,null,null,null,null,null,null,null,{"$f":"U4","v":1287},"Stunden",{"$f":"Juli!W47","v":"SOLL-Jahresarbeitszeit"}]
[null,null,null,null,null,null,null,null,null,null,null,null,null,null,null,null,null,null,null,null,{"$f":"U47-U49","v":0},"Stunden",{"$f":"Juli!W48","v":"bereits geleistete AZ am Ende des laufenden Monats "}]
[null,null,null,null,null,null,null,null,null,null,null,null,null,null,null,null,null,null,null,null,{"$f":"W44","v":1287},"Stunden",{"$f":"Juli!W49","v":"noch zu leistende AZ nach Ende des laufenden Monats (Restjahresarbeitszeit)"}]
[null,null,null,null,null,null,null,null,null,null,null,null,null,null,null,null,null,null,null,null,{"$f":"November!U5/11","v":0},"Stunden",{"$f":"Juli!W51","v":"Durchschnittliche bisherige monatliche Arbeitszeit zum Ende des Vormonats."}]
["1 Spalte O/P: Die SpalteTagesarbeitszeit wird  im MODELL  A ausgefüllt. Dabei ist hier jeweils die Gesamtarbeitszeit pro Tag in einer Summe einzutragen. Eine  Aufteilung in einzelne Arbeitsbereiche wird nur im MODELL B vorgenommen (in Spalte C bis L). \nFür die Darstellung von MODELL A wird über der Spaltenbeschriftung im Kopf (M) auf das Minus geklickt. Überflüssige Spalten werden damit ausgeblendet. (Siehe auch Arbeitshilfe.) Für die Darstellung von MODELL B wird auf das Plus-Zeichen über Spalte O geklickt. "]
["2  Spalte Q: An Urlaubstagen ist immer die Zahl 1 (und nichts anderes) einzutragen. Zusätzlich ist darauf zu achten, dass an Urlaubstagen keine Arbeitszeit ausgefüllt wird. (Sonst würde der Widerspruch in der Tabelle dargestellt, dass an Urlaubstagen gearbeitet wird. Technisch lässt sich diese Fehldarstellung nicht ausschließen, sodass dieser Hinweis selber beachtet werden muss.) ACHTUNG: Weil an Wochendenen  keine Krankheits- und Urlaubstage eingetragen werden dürfen, sind diese Felder gesperrt. An gesetzlichen Feiertagen dürfen ebenfalls keine Urlaubstage eingetragen werden. \nMitarbeitende mit einer 6-Tage-Woche können Krankheits- und Urlaubstage jeweils freitags mit hinzuzählen. Alle anderen Wochentage sind jeweils nur für eine \"1\" freigegeben."]
["3 Spalte R/S: Je Krankheitstag oder/und personenbezogener Freistellung (Freistellung für Krankheit Kinder, Zusatzfreistellungstage z.B. für Kinder und Pflege) mit einer \"1\" angeben. Angerechnet wird zur Arbeitszeit die \"reguläre tägliche AZ im GP- oder Kirchenmusikalischen Dienst\" (Feld R1). ACHTUNG: Weil an Wochendenen  keine Krankheits- und Urlaubstagstage eingetragen werden dürfen, sind diese Felder gesperrt. An gesetzlichen Feiertagen dürfen ebenfalls keine Krankheitstage eingetragen werden. \nMitarbeitende mit einer 6-Tage-Woche können Krankheitstage jeweils freitags mit hinzuzählen (statt eine 1 eine 2 eintragen). Alle anderen Wochentage sind jeweils nur für eine \"1\" freigegeben."]
["4 Spalte T: Hier werden die Arbeitsorte des jeweiligen Tages eingetragen. Wegen der  begrenzten Spaltengröße empfiehlt es sich, eigene Kürzel festzulegen."]
["5 Spalte U, Zeile 4 und 5: JAHR-SOLL entspricht der Jahresplanung; JAHR-IST enthält die tagesaktuelle, schon geleistete AZ in diesem Bereich. "]
["6 Spalte Y: Platz für Anmerkungen.  ACHTUNG: Die Schrift passt sich der Größe des Feldes an. Bei viel Text wird die Schrift sehr klein. Im Bedarfsfall kann im Eingabefeld der Text angeschaut werden. Diese Form ist notwendig, um einen Ausdruck zu ermöglichen."]

{"sheet":"Impressum","index":16,"n_rows":16,"n_cols":1,"rows_kept":16,"cut":false,"hidden":false,"merged":[]}
["Impressum:"]
["Die AZ-Dokumentation ist eine Entwicklung des "]
["Kinder- und Jugendpfarramtes der EKM."]
["Am Dom 2"]
["39104 Magdeburg"]
["Tel: 0391 5346 450"]
["Mail: kijupf@ekmd.de"]
["www.evanglischejugend.de"]
[]
["Die Verwendung ist für den Gemeindepädagogischen Dienst in der :"]
["·       Evangelischen Kirche Mitteldeutschland und der "]
["·       Evangelischen Kirche Anhalts "]
["für alle Mitarbeitende im Geltungsbereich der KAVO §42 vorgesehen. "]
[]
["Fragen und Hinweise zur Anwendung oder zu weiteren Verwendung außerhalb der EKM:"]
["gernot.quasebarth@ekmd.de"]

{"sheet":"Januar-Druck","index":17,"n_rows":43,"n_cols":8,"rows_kept":43,"cut":false,"hidden":false,"merged":[[0,0,0,1],[5,0,5,1],[2,6,5,6],[39,0,39,7],[42,0,42,2],[42,3,42,4],[40,0,40,7]]}
[{"$f":"Januar!V1","v":"JANUAR"},null,{"$f":"Stammdaten!C2","v":2023},null,null,null,null,{"$f":"Stammdaten!B3","v":0}]
["JAZ",null,{"$f":"Stammdaten!B26","v":1287}]
["Jahres-IST",null,{"$f":"Januar!U5","v":0}]
["Verbleibende AZ",null,{"$f":"Januar!W44","v":1287}]
["Urlaub im Monat",null,{"$f":"Januar!Q45","v":0}]
["Resturlaub zum Ende des Monats",null,{"$f":"Januar!Q5","v":30}]
["Datum","Tag","AZ","Urlaub","Krank/\nFreistellung","Ort","Plausibilität","Anmerkungen"]
["1.1.",{"$f":"VLOOKUP(A8,Januar!A:Z,2,FALSE)","v":"So"},{"$f":"VLOOKUP(A8,Januar!A:Y,21,FALSE)","v":0},{"$f":"VLOOKUP(A8,Januar!A:Z,17,FALSE)","v":0},{"$f":"VLOOKUP(A8,Januar!A:Z,18,FALSE)","v":0},{"$f":"VLOOKUP(A8,Januar!A:AA,20,FALSE)","v":0},{"$f":"VLOOKUP(A8,Januar!A:AB,26,FALSE)","v":""},{"$f":"VLOOKUP(A8,Januar!A:AC,25,FALSE)","v":0}]
["2.1.",{"$f":"VLOOKUP(A9,Januar!A:Z,2,FALSE)","v":"Mo"},{"$f":"VLOOKUP(A9,Januar!A:Y,21,FALSE)","v":0},{"$f":"VLOOKUP(A9,Januar!A:Z,17,FALSE)","v":0},{"$f":"VLOOKUP(A9,Januar!A:Z,18,FALSE)","v":0},{"$f":"VLOOKUP(A9,Januar!A:AA,20,FALSE)","v":0},{"$f":"VLOOKUP(A9,Januar!A:AB,26,FALSE)","v":""},{"$f":"VLOOKUP(A9,Januar!A:AC,25,FALSE)","v":0}]
["3.1.",{"$f":"VLOOKUP(A10,Januar!A:Z,2,FALSE)","v":"Die"},{"$f":"VLOOKUP(A10,Januar!A:Y,21,FALSE)","v":0},{"$f":"VLOOKUP(A10,Januar!A:Z,17,FALSE)","v":0},{"$f":"VLOOKUP(A10,Januar!A:Z,18,FALSE)","v":0},{"$f":"VLOOKUP(A10,Januar!A:AA,20,FALSE)","v":0},{"$f":"VLOOKUP(A10,Januar!A:AB,26,FALSE)","v":""},{"$f":"VLOOKUP(A10,Januar!A:AC,25,FALSE)","v":0}]
["4.1.",{"$f":"VLOOKUP(A11,Januar!A:Z,2,FALSE)","v":"Mi"},{"$f":"VLOOKUP(A11,Januar!A:Y,21,FALSE)","v":0},{"$f":"VLOOKUP(A11,Januar!A:Z,17,FALSE)","v":0},{"$f":"VLOOKUP(A11,Januar!A:Z,18,FALSE)","v":0},{"$f":"VLOOKUP(A11,Januar!A:AA,20,FALSE)","v":0},{"$f":"VLOOKUP(A11,Januar!A:AB,26,FALSE)","v":""},{"$f":"VLOOKUP(A11,Januar!A:AC,25,FALSE)","v":0}]
["5.1.",{"$f":"VLOOKUP(A12,Januar!A:Z,2,FALSE)","v":"Do"},{"$f":"VLOOKUP(A12,Januar!A:Y,21,FALSE)","v":0},{"$f":"VLOOKUP(A12,Januar!A:Z,17,FALSE)","v":0},{"$f":"VLOOKUP(A12,Januar!A:Z,18,FALSE)","v":0},{"$f":"VLOOKUP(A12,Januar!A:AA,20,FALSE)","v":0},{"$f":"VLOOKUP(A12,Januar!A:AB,26,FALSE)","v":""},{"$f":"VLOOKUP(A12,Januar!A:AC,25,FALSE)","v":0}]
["6.1.",{"$f":"VLOOKUP(A13,Januar!A:Z,2,FALSE)","v":"Fr"},{"$f":"VLOOKUP(A13,Januar!A:Y,21,FALSE)","v":0},{"$f":"VLOOKUP(A13,Januar!A:Z,17,FALSE)","v":0},{"$f":"VLOOKUP(A13,Januar!A:Z,18,FALSE)","v":0},{"$f":"VLOOKUP(A13,Januar!A:AA,20,FALSE)","v":0},{"$f":"VLOOKUP(A13,Januar!A:AB,26,FALSE)","v":""},{"$f":"VLOOKUP(A13,Januar!A:AC,25,FALSE)","v":0}]
["7.1.",{"$f":"VLOOKUP(A14,Januar!A:Z,2,FALSE)","v":"Sa"},{"$f":"VLOOKUP(A14,Januar!A:Y,21,FALSE)","v":0},{"$f":"VLOOKUP(A14,Januar!A:Z,17,FALSE)","v":0},{"$f":"VLOOKUP(A14,Januar!A:Z,18,FALSE)","v":0},{"$f":"VLOOKUP(A14,Januar!A:AA,20,FALSE)","v":0},{"$f":"VLOOKUP(A14,Januar!A:AB,26,FALSE)","v":""},{"$f":"VLOOKUP(A14,Januar!A:AC,25,FALSE)","v":0}]
["8.1.",{"$f":"VLOOKUP(A15,Januar!A:Z,2,FALSE)","v":"So"},{"$f":"VLOOKUP(A15,Januar!A:Y,21,FALSE)","v":0},{"$f":"VLOOKUP(A15,Januar!A:Z,17,FALSE)","v":0},{"$f":"VLOOKUP(A15,Januar!A:Z,18,FALSE)","v":0},{"$f":"VLOOKUP(A15,Januar!A:AA,20,FALSE)","v":0},{"$f":"VLOOKUP(A15,Januar!A:AB,26,FALSE)","v":""},{"$f":"VLOOKUP(A15,Januar!A:AC,25,FALSE)","v":0}]
["9.1.",{"$f":"VLOOKUP(A16,Januar!A:Z,2,FALSE)","v":"Mo"},{"$f":"VLOOKUP(A16,Januar!A:Y,21,FALSE)","v":0},{"$f":"VLOOKUP(A16,Januar!A:Z,17,FALSE)","v":0},{"$f":"VLOOKUP(A16,Januar!A:Z,18,FALSE)","v":0},{"$f":"VLOOKUP(A16,Januar!A:AA,20,FALSE)","v":0},{"$f":"VLOOKUP(A16,Januar!A:AB,26,FALSE)","v":""},{"$f":"VLOOKUP(A16,Januar!A:AC,25,FALSE)","v":0}]
["10.1.",{"$f":"VLOOKUP(A17,Januar!A:Z,2,FALSE)","v":"Die"},{"$f":"VLOOKUP(A17,Januar!A:Y,21,FALSE)","v":0},{"$f":"VLOOKUP(A17,Januar!A:Z,17,FALSE)","v":0},{"$f":"VLOOKUP(A17,Januar!A:Z,18,FALSE)","v":0},{"$f":"VLOOKUP(A17,Januar!A:AA,20,FALSE)","v":0},{"$f":"VLOOKUP(A17,Januar!A:AB,26,FALSE)","v":""},{"$f":"VLOOKUP(A17,Januar!A:AC,25,FALSE)","v":0}]
["11.1.",{"$f":"VLOOKUP(A18,Januar!A:Z,2,FALSE)","v":"Mi"},{"$f":"VLOOKUP(A18,Januar!A:Y,21,FALSE)","v":0},{"$f":"VLOOKUP(A18,Januar!A:Z,17,FALSE)","v":0},{"$f":"VLOOKUP(A18,Januar!A:Z,18,FALSE)","v":0},{"$f":"VLOOKUP(A18,Januar!A:AA,20,FALSE)","v":0},{"$f":"VLOOKUP(A18,Januar!A:AB,26,FALSE)","v":""},{"$f":"VLOOKUP(A18,Januar!A:AC,25,FALSE)","v":0}]
["12.1.",{"$f":"VLOOKUP(A19,Januar!A:Z,2,FALSE)","v":"Do"},{"$f":"VLOOKUP(A19,Januar!A:Y,21,FALSE)","v":0},{"$f":"VLOOKUP(A19,Januar!A:Z,17,FALSE)","v":0},{"$f":"VLOOKUP(A19,Januar!A:Z,18,FALSE)","v":0},{"$f":"VLOOKUP(A19,Januar!A:AA,20,FALSE)","v":0},{"$f":"VLOOKUP(A19,Januar!A:AB,26,FALSE)","v":""},{"$f":"VLOOKUP(A19,Januar!A:AC,25,FALSE)","v":0}]
["13.1.",{"$f":"VLOOKUP(A20,Januar!A:Z,2,FALSE)","v":"Fr"},{"$f":"VLOOKUP(A20,Januar!A:Y,21,FALSE)","v":0},{"$f":"VLOOKUP(A20,Januar!A:Z,17,FALSE)","v":0},{"$f":"VLOOKUP(A20,Januar!A:Z,18,FALSE)","v":0},{"$f":"VLOOKUP(A20,Januar!A:AA,20,FALSE)","v":0},{"$f":"VLOOKUP(A20,Januar!A:AB,26,FALSE)","v":""},{"$f":"VLOOKUP(A20,Januar!A:AC,25,FALSE)","v":0}]
["14.1.",{"$f":"VLOOKUP(A21,Januar!A:Z,2,FALSE)","v":"Sa"},{"$f":"VLOOKUP(A21,Januar!A:Y,21,FALSE)","v":0},{"$f":"VLOOKUP(A21,Januar!A:Z,17,FALSE)","v":0},{"$f":"VLOOKUP(A21,Januar!A:Z,18,FALSE)","v":0},{"$f":"VLOOKUP(A21,Januar!A:AA,20,FALSE)","v":0},{"$f":"VLOOKUP(A21,Januar!A:AB,26,FALSE)","v":""},{"$f":"VLOOKUP(A21,Januar!A:AC,25,FALSE)","v":0}]
["15.1.",{"$f":"VLOOKUP(A22,Januar!A:Z,2,FALSE)","v":"So"},{"$f":"VLOOKUP(A22,Januar!A:Y,21,FALSE)","v":0},{"$f":"VLOOKUP(A22,Januar!A:Z,17,FALSE)","v":0},{"$f":"VLOOKUP(A22,Januar!A:Z,18,FALSE)","v":0},{"$f":"VLOOKUP(A22,Januar!A:AA,20,FALSE)","v":0},{"$f":"VLOOKUP(A22,Januar!A:AB,26,FALSE)","v":""},{"$f":"VLOOKUP(A22,Januar!A:AC,25,FALSE)","v":0}]
["16.1.",{"$f":"VLOOKUP(A23,Januar!A:Z,2,FALSE)","v":"Mo"},{"$f":"VLOOKUP(A23,Januar!A:Y,21,FALSE)","v":0},{"$f":"VLOOKUP(A23,Januar!A:Z,17,FALSE)","v":0},{"$f":"VLOOKUP(A23,Januar!A:Z,18,FALSE)","v":0},{"$f":"VLOOKUP(A23,Januar!A:AA,20,FALSE)","v":0},{"$f":"VLOOKUP(A23,Januar!A:AB,26,FALSE)","v":""},{"$f":"VLOOKUP(A23,Januar!A:AC,25,FALSE)","v":0}]
["17.1.",{"$f":"VLOOKUP(A24,Januar!A:Z,2,FALSE)","v":"Die"},{"$f":"VLOOKUP(A24,Januar!A:Y,21,FALSE)","v":0},{"$f":"VLOOKUP(A24,Januar!A:Z,17,FALSE)","v":0},{"$f":"VLOOKUP(A24,Januar!A:Z,18,FALSE)","v":0},{"$f":"VLOOKUP(A24,Januar!A:AA,20,FALSE)","v":0},{"$f":"VLOOKUP(A24,Januar!A:AB,26,FALSE)","v":""},{"$f":"VLOOKUP(A24,Januar!A:AC,25,FALSE)","v":0}]
["18.1.",{"$f":"VLOOKUP(A25,Januar!A:Z,2,FALSE)","v":"Mi"},{"$f":"VLOOKUP(A25,Januar!A:Y,21,FALSE)","v":0},{"$f":"VLOOKUP(A25,Januar!A:Z,17,FALSE)","v":0},{"$f":"VLOOKUP(A25,Januar!A:Z,18,FALSE)","v":0},{"$f":"VLOOKUP(A25,Januar!A:AA,20,FALSE)","v":0},{"$f":"VLOOKUP(A25,Januar!A:AB,26,FALSE)","v":""},{"$f":"VLOOKUP(A25,Januar!A:AC,25,FALSE)","v":0}]
["19.1.",{"$f":"VLOOKUP(A26,Januar!A:Z,2,FALSE)","v":"Do"},{"$f":"VLOOKUP(A26,Januar!A:Y,21,FALSE)","v":0},{"$f":"VLOOKUP(A26,Januar!A:Z,17,FALSE)","v":0},{"$f":"VLOOKUP(A26,Januar!A:Z,18,FALSE)","v":0},{"$f":"VLOOKUP(A26,Januar!A:AA,20,FALSE)","v":0},{"$f":"VLOOKUP(A26,Januar!A:AB,26,FALSE)","v":""},{"$f":"VLOOKUP(A26,Januar!A:AC,25,FALSE)","v":0}]
["20.1.",{"$f":"VLOOKUP(A27,Januar!A:Z,2,FALSE)","v":"Fr"},{"$f":"VLOOKUP(A27,Januar!A:Y,21,FALSE)","v":0},{"$f":"VLOOKUP(A27,Januar!A:Z,17,FALSE)","v":0},{"$f":"VLOOKUP(A27,Januar!A:Z,18,FALSE)","v":0},{"$f":"VLOOKUP(A27,Januar!A:AA,20,FALSE)","v":0},{"$f":"VLOOKUP(A27,Januar!A:AB,26,FALSE)","v":""},{"$f":"VLOOKUP(A27,Januar!A:AC,25,FALSE)","v":0}]
["21.1.",{"$f":"VLOOKUP(A28,Januar!A:Z,2,FALSE)","v":"Sa"},{"$f":"VLOOKUP(A28,Januar!A:Y,21,FALSE)","v":0},{"$f":"VLOOKUP(A28,Januar!A:Z,17,FALSE)","v":0},{"$f":"VLOOKUP(A28,Januar!A:Z,18,FALSE)","v":0},{"$f":"VLOOKUP(A28,Januar!A:AA,20,FALSE)","v":0},{"$f":"VLOOKUP(A28,Januar!A:AB,26,FALSE)","v":""},{"$f":"VLOOKUP(A28,Januar!A:AC,25,FALSE)","v":0}]
["22.1.",{"$f":"VLOOKUP(A29,Januar!A:Z,2,FALSE)","v":"So"},{"$f":"VLOOKUP(A29,Januar!A:Y,21,FALSE)","v":0},{"$f":"VLOOKUP(A29,Januar!A:Z,17,FALSE)","v":0},{"$f":"VLOOKUP(A29,Januar!A:Z,18,FALSE)","v":0},{"$f":"VLOOKUP(A29,Januar!A:AA,20,FALSE)","v":0},{"$f":"VLOOKUP(A29,Januar!A:AB,26,FALSE)","v":""},{"$f":"VLOOKUP(A29,Januar!A:AC,25,FALSE)","v":0}]
["23.1.",{"$f":"VLOOKUP(A30,Januar!A:Z,2,FALSE)","v":"Mo"},{"$f":"VLOOKUP(A30,Januar!A:Y,21,FALSE)","v":0},{"$f":"VLOOKUP(A30,Januar!A:Z,17,FALSE)","v":0},{"$f":"VLOOKUP(A30,Januar!A:Z,18,FALSE)","v":0},{"$f":"VLOOKUP(A30,Januar!A:AA,20,FALSE)","v":0},{"$f":"VLOOKUP(A30,Januar!A:AB,26,FALSE)","v":""},{"$f":"VLOOKUP(A30,Januar!A:AC,25,FALSE)","v":0}]
["24.1.",{"$f":"VLOOKUP(A31,Januar!A:Z,2,FALSE)","v":"Die"},{"$f":"VLOOKUP(A31,Januar!A:Y,21,FALSE)","v":0},{"$f":"VLOOKUP(A31,Januar!A:Z,17,FALSE)","v":0},{"$f":"VLOOKUP(A31,Januar!A:Z,18,FALSE)","v":0},{"$f":"VLOOKUP(A31,Januar!A:AA,20,FALSE)","v":0},{"$f":"VLOOKUP(A31,Januar!A:AB,26,FALSE)","v":""},{"$f":"VLOOKUP(A31,Januar!A:AC,25,FALSE)","v":0}]
["25.1.",{"$f":"VLOOKUP(A32,Januar!A:Z,2,FALSE)","v":"Mi"},{"$f":"VLOOKUP(A32,Januar!A:Y,21,FALSE)","v":0},{"$f":"VLOOKUP(A32,Januar!A:Z,17,FALSE)","v":0},{"$f":"VLOOKUP(A32,Januar!A:Z,18,FALSE)","v":0},{"$f":"VLOOKUP(A32,Januar!A:AA,20,FALSE)","v":0},{"$f":"VLOOKUP(A32,Januar!A:AB,26,FALSE)","v":""},{"$f":"VLOOKUP(A32,Januar!A:AC,25,FALSE)","v":0}]
["26.1.",{"$f":"VLOOKUP(A33,Januar!A:Z,2,FALSE)","v":"Do"},{"$f":"VLOOKUP(A33,Januar!A:Y,21,FALSE)","v":0},{"$f":"VLOOKUP(A33,Januar!A:Z,17,FALSE)","v":0},{"$f":"VLOOKUP(A33,Januar!A:Z,18,FALSE)","v":0},{"$f":"VLOOKUP(A33,Januar!A:AA,20,FALSE)","v":0},{"$f":"VLOOKUP(A33,Januar!A:AB,26,FALSE)","v":""},{"$f":"VLOOKUP(A33,Januar!A:AC,25,FALSE)","v":0}]
["27.1.",{"$f":"VLOOKUP(A34,Januar!A:Z,2,FALSE)","v":"Fr"},{"$f":"VLOOKUP(A34,Januar!A:Y,21,FALSE)","v":0},{"$f":"VLOOKUP(A34,Januar!A:Z,17,FALSE)","v":0},{"$f":"VLOOKUP(A34,Januar!A:Z,18,FALSE)","v":0},{"$f":"VLOOKUP(A34,Januar!A:AA,20,FALSE)","v":0},{"$f":"VLOOKUP(A34,Januar!A:AB,26,FALSE)","v":""},{"$f":"VLOOKUP(A34,Januar!A:AC,25,FALSE)","v":0}]
["28.1.",{"$f":"VLOOKUP(A35,Januar!A:Z,2,FALSE)","v":"Sa"},{"$f":"VLOOKUP(A35,Januar!A:Y,21,FALSE)","v":0},{"$f":"VLOOKUP(A35,Januar!A:Z,17,FALSE)","v":0},{"$f":"VLOOKUP(A35,Januar!A:Z,18,FALSE)","v":0},{"$f":"VLOOKUP(A35,Januar!A:AA,20,FALSE)","v":0},{"$f":"VLOOKUP(A35,Januar!A:AB,26,FALSE)","v":""},{"$f":"VLOOKUP(A35,Januar!A:AC,25,FALSE)","v":0}]
["29.1.",{"$f":"VLOOKUP(A36,Januar!A:Z,2,FALSE)","v":"So"},{"$f":"VLOOKUP(A36,Januar!A:Y,21,FALSE)","v":0},{"$f":"VLOOKUP(A36,Januar!A:Z,17,FALSE)","v":0},{"$f":"VLOOKUP(A36,Januar!A:Z,18,FALSE)","v":0},{"$f":"VLOOKUP(A36,Januar!A:AA,20,FALSE)","v":0},{"$f":"VLOOKUP(A36,Januar!A:AB,26,FALSE)","v":""},{"$f":"VLOOKUP(A36,Januar!A:AC,25,FALSE)","v":0}]
["30.1.",{"$f":"VLOOKUP(A37,Januar!A:Z,2,FALSE)","v":"Mo"},{"$f":"VLOOKUP(A37,Januar!A:Y,21,FALSE)","v":0},{"$f":"VLOOKUP(A37,Januar!A:Z,17,FALSE)","v":0},{"$f":"VLOOKUP(A37,Januar!A:Z,18,FALSE)","v":0},{"$f":"VLOOKUP(A37,Januar!A:AA,20,FALSE)","v":0},{"$f":"VLOOKUP(A37,Januar!A:AB,26,FALSE)","v":""},{"$f":"VLOOKUP(A37,Januar!A:AC,25,FALSE)","v":0}]
["31.1.",{"$f":"VLOOKUP(A38,Januar!A:Z,2,FALSE)","v":"Di"},{"$f":"VLOOKUP(A38,Januar!A:Y,21,FALSE)","v":0},{"$f":"VLOOKUP(A38,Januar!A:Z,17,FALSE)","v":0},{"$f":"VLOOKUP(A38,Januar!A:Z,18,FALSE)","v":0},{"$f":"VLOOKUP(A38,Januar!A:AA,20,FALSE)","v":0},{"$f":"VLOOKUP(A38,Januar!A:AB,26,FALSE)","v":""},{"$f":"VLOOKUP(A38,Januar!A:AC,25,FALSE)","v":0}]
[]
["1) Die Anzeige von \"Fehler\" in Spalte G erscheint, wenn im Arbeitsblatt des entsprechenden Monats: 1. Arbeitszeit und Urlaub erfasst wurde;  2. Urlaub und Krankheit jeweils eingegeben wurde und wenn 3. in der Erfassungstabelle (Monat) an Krankheitstagen Arbeitszeit eingetragen wurde.    Hintergrund: Im Urlaub oder bei Krankheit kann nicht gearbeitet werden."]
["2) An Krankheitstagen erscheint in dieser Tabelle dennoch eine Zahl bei der Arbeitszeit. Krankheit wird in AZ umgerechnet und erhöht die IST-AZ.; Bei der \"Fehler\"anzeige wurde Arbeitszeit in den Spalten C bis O (Monatsblatt) eingetragen."]
[]
["Zum Arbeitsblatt:",null,null,"JANUAR"]

{"sheet":"Februar-Druck","index":18,"n_rows":41,"n_cols":8,"rows_kept":41,"cut":false,"hidden":false,"merged":[[40,0,40,2],[40,3,40,4],[0,0,0,1],[2,6,5,6],[5,0,5,1],[37,0,37,7],[38,0,38,7]]}
[{"$f":"Februar!V1","v":"FEBRUAR"},null,{"$f":"Stammdaten!C2","v":2023},null,null,null,null,{"$f":"Stammdaten!B3","v":0}]
["JAZ",null,{"$f":"Stammdaten!B26","v":1287}]
["Jahres-IST",null,{"$f":"Februar!U5","v":0}]
["Verbleibende AZ",null,{"$f":"Februar!W44","v":1287}]
["Urlaub im Monat",null,{"$f":"Februar!Q45","v":0}]
["Resturlaub zum Ende des Monats",null,{"$f":"Februar!Q5","v":30}]
["Datum","Tag","AZ","Urlaub","Krank/\nFreistellung","Ort","Plausibilität","Anmerkungen"]
["1.2.",{"$f":"VLOOKUP(A8,Februar!A:Z,2,FALSE)","v":"Mi"},{"$f":"VLOOKUP(A8,Februar!A:Y,21,FALSE)","v":0},{"$f":"VLOOKUP(A8,Februar!A:Z,17,FALSE)","v":0},{"$f":"VLOOKUP(A8,Februar!A:Z,18,FALSE)","v":0},{"$f":"VLOOKUP(A8,Februar!A:AA,20,FALSE)","v":0},{"$f":"VLOOKUP(A8,Februar!A:AB,26,FALSE)","v":""},{"$f":"VLOOKUP(A8,Februar!A:AC,25,FALSE)","v":0}]
["2.2.",{"$f":"VLOOKUP(A9,Februar!A:Z,2,FALSE)","v":"Do"},{"$f":"VLOOKUP(A9,Februar!A:Y,21,FALSE)","v":0},{"$f":"VLOOKUP(A9,Februar!A:Z,17,FALSE)","v":0},{"$f":"VLOOKUP(A9,Februar!A:Z,18,FALSE)","v":0},{"$f":"VLOOKUP(A9,Februar!A:AA,20,FALSE)","v":0},{"$f":"VLOOKUP(A9,Februar!A:AB,26,FALSE)","v":""},{"$f":"VLOOKUP(A9,Februar!A:AC,25,FALSE)","v":0}]
["3.2.",{"$f":"VLOOKUP(A10,Februar!A:Z,2,FALSE)","v":"Fr"},{"$f":"VLOOKUP(A10,Februar!A:Y,21,FALSE)","v":0},{"$f":"VLOOKUP(A10,Februar!A:Z,17,FALSE)","v":0},{"$f":"VLOOKUP(A10,Februar!A:Z,18,FALSE)","v":0},{"$f":"VLOOKUP(A10,Februar!A:AA,20,FALSE)","v":0},{"$f":"VLOOKUP(A10,Februar!A:AB,26,FALSE)","v":""},{"$f":"VLOOKUP(A10,Februar!A:AC,25,FALSE)","v":0}]
["4.2.",{"$f":"VLOOKUP(A11,Februar!A:Z,2,FALSE)","v":"Sa"},{"$f":"VLOOKUP(A11,Februar!A:Y,21,FALSE)","v":0},{"$f":"VLOOKUP(A11,Februar!A:Z,17,FALSE)","v":0},{"$f":"VLOOKUP(A11,Februar!A:Z,18,FALSE)","v":0},{"$f":"VLOOKUP(A11,Februar!A:AA,20,FALSE)","v":0},{"$f":"VLOOKUP(A11,Februar!A:AB,26,FALSE)","v":""},{"$f":"VLOOKUP(A11,Februar!A:AC,25,FALSE)","v":0}]
["5.2.",{"$f":"VLOOKUP(A12,Februar!A:Z,2,FALSE)","v":"So"},{"$f":"VLOOKUP(A12,Februar!A:Y,21,FALSE)","v":0},{"$f":"VLOOKUP(A12,Februar!A:Z,17,FALSE)","v":0},{"$f":"VLOOKUP(A12,Februar!A:Z,18,FALSE)","v":0},{"$f":"VLOOKUP(A12,Februar!A:AA,20,FALSE)","v":0},{"$f":"VLOOKUP(A12,Februar!A:AB,26,FALSE)","v":""},{"$f":"VLOOKUP(A12,Februar!A:AC,25,FALSE)","v":0}]
["6.2.",{"$f":"VLOOKUP(A13,Februar!A:Z,2,FALSE)","v":"Mo"},{"$f":"VLOOKUP(A13,Februar!A:Y,21,FALSE)","v":0},{"$f":"VLOOKUP(A13,Februar!A:Z,17,FALSE)","v":0},{"$f":"VLOOKUP(A13,Februar!A:Z,18,FALSE)","v":0},{"$f":"VLOOKUP(A13,Februar!A:AA,20,FALSE)","v":0},{"$f":"VLOOKUP(A13,Februar!A:AB,26,FALSE)","v":""},{"$f":"VLOOKUP(A13,Februar!A:AC,25,FALSE)","v":0}]
["7.2.",{"$f":"VLOOKUP(A14,Februar!A:Z,2,FALSE)","v":"Die"},{"$f":"VLOOKUP(A14,Februar!A:Y,21,FALSE)","v":0},{"$f":"VLOOKUP(A14,Februar!A:Z,17,FALSE)","v":0},{"$f":"VLOOKUP(A14,Februar!A:Z,18,FALSE)","v":0},{"$f":"VLOOKUP(A14,Februar!A:AA,20,FALSE)","v":0},{"$f":"VLOOKUP(A14,Februar!A:AB,26,FALSE)","v":""},{"$f":"VLOOKUP(A14,Februar!A:AC,25,FALSE)","v":0}]
["8.2.",{"$f":"VLOOKUP(A15,Februar!A:Z,2,FALSE)","v":"Mi"},{"$f":"VLOOKUP(A15,Februar!A:Y,21,FALSE)","v":0},{"$f":"VLOOKUP(A15,Februar!A:Z,17,FALSE)","v":0},{"$f":"VLOOKUP(A15,Februar!A:Z,18,FALSE)","v":0},{"$f":"VLOOKUP(A15,Februar!A:AA,20,FALSE)","v":0},{"$f":"VLOOKUP(A15,Februar!A:AB,26,FALSE)","v":""},{"$f":"VLOOKUP(A15,Februar!A:AC,25,FALSE)","v":0}]
["9.2.",{"$f":"VLOOKUP(A16,Februar!A:Z,2,FALSE)","v":"Do"},{"$f":"VLOOKUP(A16,Februar!A:Y,21,FALSE)","v":0},{"$f":"VLOOKUP(A16,Februar!A:Z,17,FALSE)","v":0},{"$f":"VLOOKUP(A16,Februar!A:Z,18,FALSE)","v":0},{"$f":"VLOOKUP(A16,Februar!A:AA,20,FALSE)","v":0},{"$f":"VLOOKUP(A16,Februar!A:AB,26,FALSE)","v":""},{"$f":"VLOOKUP(A16,Februar!A:AC,25,FALSE)","v":0}]
["10.2.",{"$f":"VLOOKUP(A17,Februar!A:Z,2,FALSE)","v":"Fr"},{"$f":"VLOOKUP(A17,Februar!A:Y,21,FALSE)","v":0},{"$f":"VLOOKUP(A17,Februar!A:Z,17,FALSE)","v":0},{"$f":"VLOOKUP(A17,Februar!A:Z,18,FALSE)","v":0},{"$f":"VLOOKUP(A17,Februar!A:AA,20,FALSE)","v":0},{"$f":"VLOOKUP(A17,Februar!A:AB,26,FALSE)","v":""},{"$f":"VLOOKUP(A17,Februar!A:AC,25,FALSE)","v":0}]
["11.2.",{"$f":"VLOOKUP(A18,Februar!A:Z,2,FALSE)","v":"Sa"},{"$f":"VLOOKUP(A18,Februar!A:Y,21,FALSE)","v":0},{"$f":"VLOOKUP(A18,Februar!A:Z,17,FALSE)","v":0},{"$f":"VLOOKUP(A18,Februar!A:Z,18,FALSE)","v":0},{"$f":"VLOOKUP(A18,Februar!A:AA,20,FALSE)","v":0},{"$f":"VLOOKUP(A18,Februar!A:AB,26,FALSE)","v":""},{"$f":"VLOOKUP(A18,Februar!A:AC,25,FALSE)","v":0}]
["12.2.",{"$f":"VLOOKUP(A19,Februar!A:Z,2,FALSE)","v":"So"},{"$f":"VLOOKUP(A19,Februar!A:Y,21,FALSE)","v":0},{"$f":"VLOOKUP(A19,Februar!A:Z,17,FALSE)","v":0},{"$f":"VLOOKUP(A19,Februar!A:Z,18,FALSE)","v":0},{"$f":"VLOOKUP(A19,Februar!A:AA,20,FALSE)","v":0},{"$f":"VLOOKUP(A19,Februar!A:AB,26,FALSE)","v":""},{"$f":"VLOOKUP(A19,Februar!A:AC,25,FALSE)","v":0}]
["13.2.",{"$f":"VLOOKUP(A20,Februar!A:Z,2,FALSE)","v":"Mo"},{"$f":"VLOOKUP(A20,Februar!A:Y,21,FALSE)","v":0},{"$f":"VLOOKUP(A20,Februar!A:Z,17,FALSE)","v":0},{"$f":"VLOOKUP(A20,Februar!A:Z,18,FALSE)","v":0},{"$f":"VLOOKUP(A20,Februar!A:AA,20,FALSE)","v":0},{"$f":"VLOOKUP(A20,Februar!A:AB,26,FALSE)","v":""},{"$f":"VLOOKUP(A20,Februar!A:AC,25,FALSE)","v":0}]
["14.2.",{"$f":"VLOOKUP(A21,Februar!A:Z,2,FALSE)","v":"Die"},{"$f":"VLOOKUP(A21,Februar!A:Y,21,FALSE)","v":0},{"$f":"VLOOKUP(A21,Februar!A:Z,17,FALSE)","v":0},{"$f":"VLOOKUP(A21,Februar!A:Z,18,FALSE)","v":0},{"$f":"VLOOKUP(A21,Februar!A:AA,20,FALSE)","v":0},{"$f":"VLOOKUP(A21,Februar!A:AB,26,FALSE)","v":""},{"$f":"VLOOKUP(A21,Februar!A:AC,25,FALSE)","v":0}]
["15.2.",{"$f":"VLOOKUP(A22,Februar!A:Z,2,FALSE)","v":"Mi"},{"$f":"VLOOKUP(A22,Februar!A:Y,21,FALSE)","v":0},{"$f":"VLOOKUP(A22,Februar!A:Z,17,FALSE)","v":0},{"$f":"VLOOKUP(A22,Februar!A:Z,18,FALSE)","v":0},{"$f":"VLOOKUP(A22,Februar!A:AA,20,FALSE)","v":0},{"$f":"VLOOKUP(A22,Februar!A:AB,26,FALSE)","v":""},{"$f":"VLOOKUP(A22,Februar!A:AC,25,FALSE)","v":0}]
["16.2.",{"$f":"VLOOKUP(A23,Februar!A:Z,2,FALSE)","v":"Do"},{"$f":"VLOOKUP(A23,Februar!A:Y,21,FALSE)","v":0},{"$f":"VLOOKUP(A23,Februar!A:Z,17,FALSE)","v":0},{"$f":"VLOOKUP(A23,Februar!A:Z,18,FALSE)","v":0},{"$f":"VLOOKUP(A23,Februar!A:AA,20,FALSE)","v":0},{"$f":"VLOOKUP(A23,Februar!A:AB,26,FALSE)","v":""},{"$f":"VLOOKUP(A23,Februar!A:AC,25,FALSE)","v":0}]
["17.2.",{"$f":"VLOOKUP(A24,Februar!A:Z,2,FALSE)","v":"Fr"},{"$f":"VLOOKUP(A24,Februar!A:Y,21,FALSE)","v":0},{"$f":"VLOOKUP(A24,Februar!A:Z,17,FALSE)","v":0},{"$f":"VLOOKUP(A24,Februar!A:Z,18,FALSE)","v":0},{"$f":"VLOOKUP(A24,Februar!A:AA,20,FALSE)","v":0},{"$f":"VLOOKUP(A24,Februar!A:AB,26,FALSE)","v":""},{"$f":"VLOOKUP(A24,Februar!A:AC,25,FALSE)","v":0}]
["18.2.",{"$f":"VLOOKUP(A25,Februar!A:Z,2,FALSE)","v":"Sa"},{"$f":"VLOOKUP(A25,Februar!A:Y,21,FALSE)","v":0},{"$f":"VLOOKUP(A25,Februar!A:Z,17,FALSE)","v":0},{"$f":"VLOOKUP(A25,Februar!A:Z,18,FALSE)","v":0},{"$f":"VLOOKUP(A25,Februar!A:AA,20,FALSE)","v":0},{"$f":"VLOOKUP(A25,Februar!A:AB,26,FALSE)","v":""},{"$f":"VLOOKUP(A25,Februar!A:AC,25,FALSE)","v":0}]
["19.2.",{"$f":"VLOOKUP(A26,Februar!A:Z,2,FALSE)","v":"So"},{"$f":"VLOOKUP(A26,Februar!A:Y,21,FALSE)","v":0},{"$f":"VLOOKUP(A26,Februar!A:Z,17,FALSE)","v":0},{"$f":"VLOOKUP(A26,Februar!A:Z,18,FALSE)","v":0},{"$f":"VLOOKUP(A26,Februar!A:AA,20,FALSE)","v":0},{"$f":"VLOOKUP(A26,Februar!A:AB,26,FALSE)","v":""},{"$f":"VLOOKUP(A26,Februar!A:AC,25,FALSE)","v":0}]
["20.2.",{"$f":"VLOOKUP(A27,Februar!A:Z,2,FALSE)","v":"Mo"},{"$f":"VLOOKUP(A27,Februar!A:Y,21,FALSE)","v":0},{"$f":"VLOOKUP(A27,Februar!A:Z,17,FALSE)","v":0},{"$f":"VLOOKUP(A27,Februar!A:Z,18,FALSE)","v":0},{"$f":"VLOOKUP(A27,Februar!A:AA,20,FALSE)","v":0},{"$f":"VLOOKUP(A27,Februar!A:AB,26,FALSE)","v":""},{"$f":"VLOOKUP(A27,Februar!A:AC,25,FALSE)","v":0}]
["21.2.",{"$f":"VLOOKUP(A28,Februar!A:Z,2,FALSE)","v":"Die"},{"$f":"VLOOKUP(A28,Februar!A:Y,21,FALSE)","v":0},{"$f":"VLOOKUP(A28,Februar!A:Z,17,FALSE)","v":0},{"$f":"VLOOKUP(A28,Februar!A:Z,18,FALSE)","v":0},{"$f":"VLOOKUP(A28,Februar!A:AA,20,FALSE)","v":0},{"$f":"VLOOKUP(A28,Februar!A:AB,26,FALSE)","v":""},{"$f":"VLOOKUP(A28,Februar!A:AC,25,FALSE)","v":0}]
["22.2.",{"$f":"VLOOKUP(A29,Februar!A:Z,2,FALSE)","v":"Mi"},{"$f":"VLOOKUP(A29,Februar!A:Y,21,FALSE)","v":0},{"$f":"VLOOKUP(A29,Februar!A:Z,17,FALSE)","v":0},{"$f":"VLOOKUP(A29,Februar!A:Z,18,FALSE)","v":0},{"$f":"VLOOKUP(A29,Februar!A:AA,20,FALSE)","v":0},{"$f":"VLOOKUP(A29,Februar!A:AB,26,FALSE)","v":""},{"$f":"VLOOKUP(A29,Februar!A:AC,25,FALSE)","v":0}]
["23.2.",{"$f":"VLOOKUP(A30,Februar!A:Z,2,FALSE)","v":"Do"},{"$f":"VLOOKUP(A30,Februar!A:Y,21,FALSE)","v":0},{"$f":"VLOOKUP(A30,Februar!A:Z,17,FALSE)","v":0},{"$f":"VLOOKUP(A30,Februar!A:Z,18,FALSE)","v":0},{"$f":"VLOOKUP(A30,Februar!A:AA,20,FALSE)","v":0},{"$f":"VLOOKUP(A30,Februar!A:AB,26,FALSE)","v":""},{"$f":"VLOOKUP(A30,Februar!A:AC,25,FALSE)","v":0}]
["24.2.",{"$f":"VLOOKUP(A31,Februar!A:Z,2,FALSE)","v":"Fr"},{"$f":"VLOOKUP(A31,Februar!A:Y,21,FALSE)","v":0},{"$f":"VLOOKUP(A31,Februar!A:Z,17,FALSE)","v":0},{"$f":"VLOOKUP(A31,Februar!A:Z,18,FALSE)","v":0},{"$f":"VLOOKUP(A31,Februar!A:AA,20,FALSE)","v":0},{"$f":"VLOOKUP(A31,Februar!A:AB,26,FALSE)","v":""},{"$f":"VLOOKUP(A31,Februar!A:AC,25,FALSE)","v":0}]
["25.2.",{"$f":"VLOOKUP(A32,Februar!A:Z,2,FALSE)","v":"Sa"},{"$f":"VLOOKUP(A32,Februar!A:Y,21,FALSE)","v":0},{"$f":"VLOOKUP(A32,Februar!A:Z,17,FALSE)","v":0},{"$f":"VLOOKUP(A32,Februar!A:Z,18,FALSE)","v":0},{"$f":"VLOOKUP(A32,Februar!A:AA,20,FALSE)","v":0},{"$f":"VLOOKUP(A32,Februar!A:AB,26,FALSE)","v":""},{"$f":"VLOOKUP(A32,Februar!A:AC,25,FALSE)","v":0}]
["26.2.",{"$f":"VLOOKUP(A33,Februar!A:Z,2,FALSE)","v":"So"},{"$f":"VLOOKUP(A33,Februar!A:Y,21,FALSE)","v":0},{"$f":"VLOOKUP(A33,Februar!A:Z,17,FALSE)","v":0},{"$f":"VLOOKUP(A33,Februar!A:Z,18,FALSE)","v":0},{"$f":"VLOOKUP(A33,Februar!A:AA,20,FALSE)","v":0},{"$f":"VLOOKUP(A33,Februar!A:AB,26,FALSE)","v":""},{"$f":"VLOOKUP(A33,Februar!A:AC,25,FALSE)","v":0}]
["27.2.",{"$f":"VLOOKUP(A34,Februar!A:Z,2,FALSE)","v":"Mo"},{"$f":"VLOOKUP(A34,Februar!A:Y,21,FALSE)","v":0},{"$f":"VLOOKUP(A34,Februar!A:Z,17,FALSE)","v":0},{"$f":"VLOOKUP(A34,Februar!A:Z,18,FALSE)","v":0},{"$f":"VLOOKUP(A34,Februar!A:AA,20,FALSE)","v":0},{"$f":"VLOOKUP(A34,Februar!A:AB,26,FALSE)","v":""},{"$f":"VLOOKUP(A34,Februar!A:AC,25,FALSE)","v":0}]
["28.2.",{"$f":"VLOOKUP(A35,Februar!A:Z,2,FALSE)","v":"Die"},{"$f":"VLOOKUP(A35,Februar!A:Y,21,FALSE)","v":0},{"$f":"VLOOKUP(A35,Februar!A:Z,17,FALSE)","v":0},{"$f":"VLOOKUP(A35,Februar!A:Z,18,FALSE)","v":0},{"$f":"VLOOKUP(A35,Februar!A:AA,20,FALSE)","v":0},{"$f":"VLOOKUP(A35,Februar!A:AB,26,FALSE)","v":""},{"$f":"VLOOKUP(A35,Februar!A:AC,25,FALSE)","v":0}]
["29.2.",{"$f":"VLOOKUP(A36,Februar!A:Z,2,FALSE)","v":{"$error":"#N/A"}},{"$f":"VLOOKUP(A36,Februar!A:Y,21,FALSE)","v":{"$error":"#N/A"}},{"$f":"VLOOKUP(A36,Februar!A:Z,17,FALSE)","v":{"$error":"#N/A"}},{"$f":"VLOOKUP(A36,Februar!A:Z,18,FALSE)","v":{"$error":"#N/A"}},{"$f":"VLOOKUP(A36,Februar!A:AA,20,FALSE)","v":{"$error":"#N/A"}},{"$f":"VLOOKUP(A36,Februar!A:AB,26,FALSE)","v":{"$error":"#N/A"}},{"$f":"VLOOKUP(A36,Februar!A:AC,25,FALSE)","v":{"$error":"#N/A"}}]
[]
["1) Die Anzeige von \"Fehler\" in Spalte G erscheint, wenn im Arbeitsblatt des entsprechenden Monats: 1. Arbeitszeit und Urlaub erfasst wurde;  2. Urlaub und Krankheit jeweils eingegeben wurde und wenn 3. in der Erfassungstabelle (Monat) an Krankheitstagen Arbeitszeit eingetragen wurde.    Hintergrund: Im Urlaub oder bei Krankheit kann nicht gearbeitet werden."]
["2) An Krankheitstagen erscheint in dieser Tabelle dennoch eine Zahl bei der Arbeitszeit. Krankheit wird in AZ umgerechnet und erhöht die IST-AZ.; Bei der \"Fehler\"anzeige wurde Arbeitszeit in den Spalten C bis O (Monatsblatt) eingetragen."]
[]
["Zum Arbeitsblatt:",null,null,"FEBRUAR"]

{"sheet":"März-Druck","index":19,"n_rows":43,"n_cols":8,"rows_kept":43,"cut":false,"hidden":false,"merged":[[42,0,42,2],[42,3,42,4],[0,0,0,1],[2,6,5,6],[5,0,5,1],[39,0,39,7],[40,0,40,7]]}
[{"$f":"März!V1","v":"MÄRZ"},null,{"$f":"Stammdaten!C2","v":2023},null,null,null,null,{"$f":"Stammdaten!B3","v":0}]
["JAZ",null,{"$f":"Stammdaten!B26","v":1287}]
["Jahres-IST",null,{"$f":"März!U5","v":0}]
["Verbleibende AZ",null,{"$f":"März!W44","v":1287}]
["Urlaub im Monat",null,{"$f":"März!Q45","v":0}]
["Resturlaub zum Ende des Monats",null,{"$f":"März!Q5","v":30}]
["Datum","Tag","AZ","Urlaub","Krank/\nFreistellung","Ort","Plausibilität","Anmerkungen"]
["1.3.",{"$f":"VLOOKUP(A8,März!A:Z,2,FALSE)","v":"Mi"},{"$f":"VLOOKUP(A8,März!A:Y,21,FALSE)","v":0},{"$f":"VLOOKUP(A8,März!A:Z,17,FALSE)","v":0},{"$f":"VLOOKUP(A8,März!A:Z,18,FALSE)","v":0},{"$f":"VLOOKUP(A8,März!A:AA,20,FALSE)","v":0},{"$f":"VLOOKUP(A8,März!A:AB,26,FALSE)","v":""},{"$f":"VLOOKUP(A8,März!A:AC,25,FALSE)","v":0}]
["2.3.",{"$f":"VLOOKUP(A9,März!A:Z,2,FALSE)","v":"Do"},{"$f":"VLOOKUP(A9,März!A:Y,21,FALSE)","v":0},{"$f":"VLOOKUP(A9,März!A:Z,17,FALSE)","v":0},{"$f":"VLOOKUP(A9,März!A:Z,18,FALSE)","v":0},{"$f":"VLOOKUP(A9,März!A:AA,20,FALSE)","v":0},{"$f":"VLOOKUP(A9,März!A:AB,26,FALSE)","v":""},{"$f":"VLOOKUP(A9,März!A:AC,25,FALSE)","v":0}]
["3.3.",{"$f":"VLOOKUP(A10,März!A:Z,2,FALSE)","v":"Fr"},{"$f":"VLOOKUP(A10,März!A:Y,21,FALSE)","v":0},{"$f":"VLOOKUP(A10,März!A:Z,17,FALSE)","v":0},{"$f":"VLOOKUP(A10,März!A:Z,18,FALSE)","v":0},{"$f":"VLOOKUP(A10,März!A:AA,20,FALSE)","v":0},{"$f":"VLOOKUP(A10,März!A:AB,26,FALSE)","v":""},{"$f":"VLOOKUP(A10,März!A:AC,25,FALSE)","v":0}]
["4.3.",{"$f":"VLOOKUP(A11,März!A:Z,2,FALSE)","v":"Sa"},{"$f":"VLOOKUP(A11,März!A:Y,21,FALSE)","v":0},{"$f":"VLOOKUP(A11,März!A:Z,17,FALSE)","v":0},{"$f":"VLOOKUP(A11,März!A:Z,18,FALSE)","v":0},{"$f":"VLOOKUP(A11,März!A:AA,20,FALSE)","v":0},{"$f":"VLOOKUP(A11,März!A:AB,26,FALSE)","v":""},{"$f":"VLOOKUP(A11,März!A:AC,25,FALSE)","v":0}]
["5.3.",{"$f":"VLOOKUP(A12,März!A:Z,2,FALSE)","v":"So"},{"$f":"VLOOKUP(A12,März!A:Y,21,FALSE)","v":0},{"$f":"VLOOKUP(A12,März!A:Z,17,FALSE)","v":0},{"$f":"VLOOKUP(A12,März!A:Z,18,FALSE)","v":0},{"$f":"VLOOKUP(A12,März!A:AA,20,FALSE)","v":0},{"$f":"VLOOKUP(A12,März!A:AB,26,FALSE)","v":""},{"$f":"VLOOKUP(A12,März!A:AC,25,FALSE)","v":0}]
["6.3.",{"$f":"VLOOKUP(A13,März!A:Z,2,FALSE)","v":"Mo"},{"$f":"VLOOKUP(A13,März!A:Y,21,FALSE)","v":0},{"$f":"VLOOKUP(A13,März!A:Z,17,FALSE)","v":0},{"$f":"VLOOKUP(A13,März!A:Z,18,FALSE)","v":0},{"$f":"VLOOKUP(A13,März!A:AA,20,FALSE)","v":0},{"$f":"VLOOKUP(A13,März!A:AB,26,FALSE)","v":""},{"$f":"VLOOKUP(A13,März!A:AC,25,FALSE)","v":0}]
["7.3.",{"$f":"VLOOKUP(A14,März!A:Z,2,FALSE)","v":"Die"},{"$f":"VLOOKUP(A14,März!A:Y,21,FALSE)","v":0},{"$f":"VLOOKUP(A14,März!A:Z,17,FALSE)","v":0},{"$f":"VLOOKUP(A14,März!A:Z,18,FALSE)","v":0},{"$f":"VLOOKUP(A14,März!A:AA,20,FALSE)","v":0},{"$f":"VLOOKUP(A14,März!A:AB,26,FALSE)","v":""},{"$f":"VLOOKUP(A14,März!A:AC,25,FALSE)","v":0}]
["8.3.",{"$f":"VLOOKUP(A15,März!A:Z,2,FALSE)","v":"Mi"},{"$f":"VLOOKUP(A15,März!A:Y,21,FALSE)","v":0},{"$f":"VLOOKUP(A15,März!A:Z,17,FALSE)","v":0},{"$f":"VLOOKUP(A15,März!A:Z,18,FALSE)","v":0},{"$f":"VLOOKUP(A15,März!A:AA,20,FALSE)","v":0},{"$f":"VLOOKUP(A15,März!A:AB,26,FALSE)","v":""},{"$f":"VLOOKUP(A15,März!A:AC,25,FALSE)","v":0}]
["9.3.",{"$f":"VLOOKUP(A16,März!A:Z,2,FALSE)","v":"Do"},{"$f":"VLOOKUP(A16,März!A:Y,21,FALSE)","v":0},{"$f":"VLOOKUP(A16,März!A:Z,17,FALSE)","v":0},{"$f":"VLOOKUP(A16,März!A:Z,18,FALSE)","v":0},{"$f":"VLOOKUP(A16,März!A:AA,20,FALSE)","v":0},{"$f":"VLOOKUP(A16,März!A:AB,26,FALSE)","v":""},{"$f":"VLOOKUP(A16,März!A:AC,25,FALSE)","v":0}]
["10.3.",{"$f":"VLOOKUP(A17,März!A:Z,2,FALSE)","v":"Fr"},{"$f":"VLOOKUP(A17,März!A:Y,21,FALSE)","v":0},{"$f":"VLOOKUP(A17,März!A:Z,17,FALSE)","v":0},{"$f":"VLOOKUP(A17,März!A:Z,18,FALSE)","v":0},{"$f":"VLOOKUP(A17,März!A:AA,20,FALSE)","v":0},{"$f":"VLOOKUP(A17,März!A:AB,26,FALSE)","v":""},{"$f":"VLOOKUP(A17,März!A:AC,25,FALSE)","v":0}]
["11.3.",{"$f":"VLOOKUP(A18,März!A:Z,2,FALSE)","v":"Sa"},{"$f":"VLOOKUP(A18,März!A:Y,21,FALSE)","v":0},{"$f":"VLOOKUP(A18,März!A:Z,17,FALSE)","v":0},{"$f":"VLOOKUP(A18,März!A:Z,18,FALSE)","v":0},{"$f":"VLOOKUP(A18,März!A:AA,20,FALSE)","v":0},{"$f":"VLOOKUP(A18,März!A:AB,26,FALSE)","v":""},{"$f":"VLOOKUP(A18,März!A:AC,25,FALSE)","v":0}]
["12.3.",{"$f":"VLOOKUP(A19,März!A:Z,2,FALSE)","v":"So"},{"$f":"VLOOKUP(A19,März!A:Y,21,FALSE)","v":0},{"$f":"VLOOKUP(A19,März!A:Z,17,FALSE)","v":0},{"$f":"VLOOKUP(A19,März!A:Z,18,FALSE)","v":0},{"$f":"VLOOKUP(A19,März!A:AA,20,FALSE)","v":0},{"$f":"VLOOKUP(A19,März!A:AB,26,FALSE)","v":""},{"$f":"VLOOKUP(A19,März!A:AC,25,FALSE)","v":0}]
["13.3.",{"$f":"VLOOKUP(A20,März!A:Z,2,FALSE)","v":"Mo"},{"$f":"VLOOKUP(A20,März!A:Y,21,FALSE)","v":0},{"$f":"VLOOKUP(A20,März!A:Z,17,FALSE)","v":0},{"$f":"VLOOKUP(A20,März!A:Z,18,FALSE)","v":0},{"$f":"VLOOKUP(A20,März!A:AA,20,FALSE)","v":0},{"$f":"VLOOKUP(A20,März!A:AB,26,FALSE)","v":""},{"$f":"VLOOKUP(A20,März!A:AC,25,FALSE)","v":0}]
["14.3.",{"$f":"VLOOKUP(A21,März!A:Z,2,FALSE)","v":"Die"},{"$f":"VLOOKUP(A21,März!A:Y,21,FALSE)","v":0},{"$f":"VLOOKUP(A21,März!A:Z,17,FALSE)","v":0},{"$f":"VLOOKUP(A21,März!A:Z,18,FALSE)","v":0},{"$f":"VLOOKUP(A21,März!A:AA,20,FALSE)","v":0},{"$f":"VLOOKUP(A21,März!A:AB,26,FALSE)","v":""},{"$f":"VLOOKUP(A21,März!A:AC,25,FALSE)","v":0}]
["15.3.",{"$f":"VLOOKUP(A22,März!A:Z,2,FALSE)","v":"Mi"},{"$f":"VLOOKUP(A22,März!A:Y,21,FALSE)","v":0},{"$f":"VLOOKUP(A22,März!A:Z,17,FALSE)","v":0},{"$f":"VLOOKUP(A22,März!A:Z,18,FALSE)","v":0},{"$f":"VLOOKUP(A22,März!A:AA,20,FALSE)","v":0},{"$f":"VLOOKUP(A22,März!A:AB,26,FALSE)","v":""},{"$f":"VLOOKUP(A22,März!A:AC,25,FALSE)","v":0}]
["16.3.",{"$f":"VLOOKUP(A23,März!A:Z,2,FALSE)","v":"Do"},{"$f":"VLOOKUP(A23,März!A:Y,21,FALSE)","v":0},{"$f":"VLOOKUP(A23,März!A:Z,17,FALSE)","v":0},{"$f":"VLOOKUP(A23,März!A:Z,18,FALSE)","v":0},{"$f":"VLOOKUP(A23,März!A:AA,20,FALSE)","v":0},{"$f":"VLOOKUP(A23,März!A:AB,26,FALSE)","v":""},{"$f":"VLOOKUP(A23,März!A:AC,25,FALSE)","v":0}]
["17.3.",{"$f":"VLOOKUP(A24,März!A:Z,2,FALSE)","v":"Fr"},{"$f":"VLOOKUP(A24,März!A:Y,21,FALSE)","v":0},{"$f":"VLOOKUP(A24,März!A:Z,17,FALSE)","v":0},{"$f":"VLOOKUP(A24,März!A:Z,18,FALSE)","v":0},{"$f":"VLOOKUP(A24,März!A:AA,20,FALSE)","v":0},{"$f":"VLOOKUP(A24,März!A:AB,26,FALSE)","v":""},{"$f":"VLOOKUP(A24,März!A:AC,25,FALSE)","v":0}]
["18.3.",{"$f":"VLOOKUP(A25,März!A:Z,2,FALSE)","v":"Sa"},{"$f":"VLOOKUP(A25,März!A:Y,21,FALSE)","v":0},{"$f":"VLOOKUP(A25,März!A:Z,17,FALSE)","v":0},{"$f":"VLOOKUP(A25,März!A:Z,18,FALSE)","v":0},{"$f":"VLOOKUP(A25,März!A:AA,20,FALSE)","v":0},{"$f":"VLOOKUP(A25,März!A:AB,26,FALSE)","v":""},{"$f":"VLOOKUP(A25,März!A:AC,25,FALSE)","v":0}]
["19.3.",{"$f":"VLOOKUP(A26,März!A:Z,2,FALSE)","v":"So"},{"$f":"VLOOKUP(A26,März!A:Y,21,FALSE)","v":0},{"$f":"VLOOKUP(A26,März!A:Z,17,FALSE)","v":0},{"$f":"VLOOKUP(A26,März!A:Z,18,FALSE)","v":0},{"$f":"VLOOKUP(A26,März!A:AA,20,FALSE)","v":0},{"$f":"VLOOKUP(A26,März!A:AB,26,FALSE)","v":""},{"$f":"VLOOKUP(A26,März!A:AC,25,FALSE)","v":0}]
["20.3.",{"$f":"VLOOKUP(A27,März!A:Z,2,FALSE)","v":"Mo"},{"$f":"VLOOKUP(A27,März!A:Y,21,FALSE)","v":0},{"$f":"VLOOKUP(A27,März!A:Z,17,FALSE)","v":0},{"$f":"VLOOKUP(A27,März!A:Z,18,FALSE)","v":0},{"$f":"VLOOKUP(A27,März!A:AA,20,FALSE)","v":0},{"$f":"VLOOKUP(A27,März!A:AB,26,FALSE)","v":""},{"$f":"VLOOKUP(A27,März!A:AC,25,FALSE)","v":0}]
["21.3.",{"$f":"VLOOKUP(A28,März!A:Z,2,FALSE)","v":"Die"},{"$f":"VLOOKUP(A28,März!A:Y,21,FALSE)","v":0},{"$f":"VLOOKUP(A28,März!A:Z,17,FALSE)","v":0},{"$f":"VLOOKUP(A28,März!A:Z,18,FALSE)","v":0},{"$f":"VLOOKUP(A28,März!A:AA,20,FALSE)","v":0},{"$f":"VLOOKUP(A28,März!A:AB,26,FALSE)","v":""},{"$f":"VLOOKUP(A28,März!A:AC,25,FALSE)","v":0}]
["22.3.",{"$f":"VLOOKUP(A29,März!A:Z,2,FALSE)","v":"Mi"},{"$f":"VLOOKUP(A29,März!A:Y,21,FALSE)","v":0},{"$f":"VLOOKUP(A29,März!A:Z,17,FALSE)","v":0},{"$f":"VLOOKUP(A29,März!A:Z,18,FALSE)","v":0},{"$f":"VLOOKUP(A29,März!A:AA,20,FALSE)","v":0},{"$f":"VLOOKUP(A29,März!A:AB,26,FALSE)","v":""},{"$f":"VLOOKUP(A29,März!A:AC,25,FALSE)","v":0}]
["23.3.",{"$f":"VLOOKUP(A30,März!A:Z,2,FALSE)","v":"Do"},{"$f":"VLOOKUP(A30,März!A:Y,21,FALSE)","v":0},{"$f":"VLOOKUP(A30,März!A:Z,17,FALSE)","v":0},{"$f":"VLOOKUP(A30,März!A:Z,18,FALSE)","v":0},{"$f":"VLOOKUP(A30,März!A:AA,20,FALSE)","v":0},{"$f":"VLOOKUP(A30,März!A:AB,26,FALSE)","v":""},{"$f":"VLOOKUP(A30,März!A:AC,25,FALSE)","v":0}]
["24.3.",{"$f":"VLOOKUP(A31,März!A:Z,2,FALSE)","v":"Fr"},{"$f":"VLOOKUP(A31,März!A:Y,21,FALSE)","v":0},{"$f":"VLOOKUP(A31,März!A:Z,17,FALSE)","v":0},{"$f":"VLOOKUP(A31,März!A:Z,18,FALSE)","v":0},{"$f":"VLOOKUP(A31,März!A:AA,20,FALSE)","v":0},{"$f":"VLOOKUP(A31,März!A:AB,26,FALSE)","v":""},{"$f":"VLOOKUP(A31,März!A:AC,25,FALSE)","v":0}]
["25.3.",{"$f":"VLOOKUP(A32,März!A:Z,2,FALSE)","v":"Sa"},{"$f":"VLOOKUP(A32,März!A:Y,21,FALSE)","v":0},{"$f":"VLOOKUP(A32,März!A:Z,17,FALSE)","v":0},{"$f":"VLOOKUP(A32,März!A:Z,18,FALSE)","v":0},{"$f":"VLOOKUP(A32,März!A:AA,20,FALSE)","v":0},{"$f":"VLOOKUP(A32,März!A:AB,26,FALSE)","v":""},{"$f":"VLOOKUP(A32,März!A:AC,25,FALSE)","v":0}]
["26.3.",{"$f":"VLOOKUP(A33,März!A:Z,2,FALSE)","v":"So"},{"$f":"VLOOKUP(A33,März!A:Y,21,FALSE)","v":0},{"$f":"VLOOKUP(A33,März!A:Z,17,FALSE)","v":0},{"$f":"VLOOKUP(A33,März!A:Z,18,FALSE)","v":0},{"$f":"VLOOKUP(A33,März!A:AA,20,FALSE)","v":0},{"$f":"VLOOKUP(A33,März!A:AB,26,FALSE)","v":""},{"$f":"VLOOKUP(A33,März!A:AC,25,FALSE)","v":0}]
["27.3.",{"$f":"VLOOKUP(A34,März!A:Z,2,FALSE)","v":"Mo"},{"$f":"VLOOKUP(A34,März!A:Y,21,FALSE)","v":0},{"$f":"VLOOKUP(A34,März!A:Z,17,FALSE)","v":0},{"$f":"VLOOKUP(A34,März!A:Z,18,FALSE)","v":0},{"$f":"VLOOKUP(A34,März!A:AA,20,FALSE)","v":0},{"$f":"VLOOKUP(A34,März!A:AB,26,FALSE)","v":""},{"$f":"VLOOKUP(A34,März!A:AC,25,FALSE)","v":0}]
["28.3.",{"$f":"VLOOKUP(A35,März!A:Z,2,FALSE)","v":"Die"},{"$f":"VLOOKUP(A35,März!A:Y,21,FALSE)","v":0},{"$f":"VLOOKUP(A35,März!A:Z,17,FALSE)","v":0},{"$f":"VLOOKUP(A35,März!A:Z,18,FALSE)","v":0},{"$f":"VLOOKUP(A35,März!A:AA,20,FALSE)","v":0},{"$f":"VLOOKUP(A35,März!A:AB,26,FALSE)","v":""},{"$f":"VLOOKUP(A35,März!A:AC,25,FALSE)","v":0}]
["29.3.",{"$f":"VLOOKUP(A36,März!A:Z,2,FALSE)","v":"Mi"},{"$f":"VLOOKUP(A36,März!A:Y,21,FALSE)","v":0},{"$f":"VLOOKUP(A36,März!A:Z,17,FALSE)","v":0},{"$f":"VLOOKUP(A36,März!A:Z,18,FALSE)","v":0},{"$f":"VLOOKUP(A36,März!A:AA,20,FALSE)","v":0},{"$f":"VLOOKUP(A36,März!A:AB,26,FALSE)","v":""},{"$f":"VLOOKUP(A36,März!A:AC,25,FALSE)","v":0}]
["30.3.",{"$f":"VLOOKUP(A37,März!A:Z,2,FALSE)","v":"Do"},{"$f":"VLOOKUP(A37,März!A:Y,21,FALSE)","v":0},{"$f":"VLOOKUP(A37,März!A:Z,17,FALSE)","v":0},{"$f":"VLOOKUP(A37,März!A:Z,18,FALSE)","v":0},{"$f":"VLOOKUP(A37,März!A:AA,20,FALSE)","v":0},{"$f":"VLOOKUP(A37,März!A:AB,26,FALSE)","v":""},{"$f":"VLOOKUP(A37,März!A:AC,25,FALSE)","v":0}]
["31.3.",{"$f":"VLOOKUP(A38,März!A:Z,2,FALSE)","v":"Fr"},{"$f":"VLOOKUP(A38,März!A:Y,21,FALSE)","v":0},{"$f":"VLOOKUP(A38,März!A:Z,17,FALSE)","v":0},{"$f":"VLOOKUP(A38,März!A:Z,18,FALSE)","v":0},{"$f":"VLOOKUP(A38,März!A:AA,20,FALSE)","v":0},{"$f":"VLOOKUP(A38,März!A:AB,26,FALSE)","v":""},{"$f":"VLOOKUP(A38,März!A:AC,25,FALSE)","v":0}]
[]
["1) Die Anzeige von \"Fehler\" in Spalte G erscheint, wenn im Arbeitsblatt des entsprechenden Monats: 1. Arbeitszeit und Urlaub erfasst wurde;  2. Urlaub und Krankheit jeweils eingegeben wurde und wenn 3. in der Erfassungstabelle (Monat) an Krankheitstagen Arbeitszeit eingetragen wurde.    Hintergrund: Im Urlaub oder bei Krankheit kann nicht gearbeitet werden."]
["2) An Krankheitstagen erscheint in dieser Tabelle dennoch eine Zahl bei der Arbeitszeit. Krankheit wird in AZ umgerechnet und erhöht die IST-AZ.; Bei der \"Fehler\"anzeige wurde Arbeitszeit in den Spalten C bis O (Monatsblatt) eingetragen."]
[]
["Zum Arbeitsblatt:",null,null,"MÄRZ"]

{"sheet":"April-Druck","index":20,"n_rows":42,"n_cols":8,"rows_kept":42,"cut":false,"hidden":false,"merged":[[41,0,41,2],[41,3,41,4],[0,0,0,1],[2,6,5,6],[5,0,5,1],[38,0,38,7],[39,0,39,7]]}
[{"$f":"April!V1","v":"APRIL"},null,{"$f":"Stammdaten!C2","v":2023},null,null,null,null,{"$f":"Stammdaten!B3","v":0}]
["JAZ",null,{"$f":"Stammdaten!B26","v":1287}]
["Jahres-IST",null,{"$f":"April!U5","v":0}]
["Verbleibende AZ",null,{"$f":"April!W44","v":1287}]
["Urlaub im Monat",null,{"$f":"April!Q45","v":0}]
["Resturlaub zum Ende des Monats",null,{"$f":"April!Q5","v":30}]
["Datum","Tag","AZ","Urlaub","Krank/\nFreistellung","Ort","Plausibilität","Anmerkungen"]
["1.4.",{"$f":"VLOOKUP(A8,April!A:Z,2,FALSE)","v":"Sa"},{"$f":"VLOOKUP(A8,April!A:Y,21,FALSE)","v":0},{"$f":"VLOOKUP(A8,April!A:Z,17,FALSE)","v":0},{"$f":"VLOOKUP(A8,April!A:Z,18,FALSE)","v":0},{"$f":"VLOOKUP(A8,April!A:AA,20,FALSE)","v":0},{"$f":"VLOOKUP(A8,April!A:AB,26,FALSE)","v":""},{"$f":"VLOOKUP(A8,April!A:AC,25,FALSE)","v":0}]
["2.4.",{"$f":"VLOOKUP(A9,April!A:Z,2,FALSE)","v":"So"},{"$f":"VLOOKUP(A9,April!A:Y,21,FALSE)","v":0},{"$f":"VLOOKUP(A9,April!A:Z,17,FALSE)","v":0},{"$f":"VLOOKUP(A9,April!A:Z,18,FALSE)","v":0},{"$f":"VLOOKUP(A9,April!A:AA,20,FALSE)","v":0},{"$f":"VLOOKUP(A9,April!A:AB,26,FALSE)","v":""},{"$f":"VLOOKUP(A9,April!A:AC,25,FALSE)","v":0}]
["3.4.",{"$f":"VLOOKUP(A10,April!A:Z,2,FALSE)","v":"Mo"},{"$f":"VLOOKUP(A10,April!A:Y,21,FALSE)","v":0},{"$f":"VLOOKUP(A10,April!A:Z,17,FALSE)","v":0},{"$f":"VLOOKUP(A10,April!A:Z,18,FALSE)","v":0},{"$f":"VLOOKUP(A10,April!A:AA,20,FALSE)","v":0},{"$f":"VLOOKUP(A10,April!A:AB,26,FALSE)","v":""},{"$f":"VLOOKUP(A10,April!A:AC,25,FALSE)","v":0}]
["4.4.",{"$f":"VLOOKUP(A11,April!A:Z,2,FALSE)","v":"Die"},{"$f":"VLOOKUP(A11,April!A:Y,21,FALSE)","v":0},{"$f":"VLOOKUP(A11,April!A:Z,17,FALSE)","v":0},{"$f":"VLOOKUP(A11,April!A:Z,18,FALSE)","v":0},{"$f":"VLOOKUP(A11,April!A:AA,20,FALSE)","v":0},{"$f":"VLOOKUP(A11,April!A:AB,26,FALSE)","v":""},{"$f":"VLOOKUP(A11,April!A:AC,25,FALSE)","v":0}]
["5.4.",{"$f":"VLOOKUP(A12,April!A:Z,2,FALSE)","v":"Mi"},{"$f":"VLOOKUP(A12,April!A:Y,21,FALSE)","v":0},{"$f":"VLOOKUP(A12,April!A:Z,17,FALSE)","v":0},{"$f":"VLOOKUP(A12,April!A:Z,18,FALSE)","v":0},{"$f":"VLOOKUP(A12,April!A:AA,20,FALSE)","v":0},{"$f":"VLOOKUP(A12,April!A:AB,26,FALSE)","v":""},{"$f":"VLOOKUP(A12,April!A:AC,25,FALSE)","v":0}]
["6.4.",{"$f":"VLOOKUP(A13,April!A:Z,2,FALSE)","v":"Do"},{"$f":"VLOOKUP(A13,April!A:Y,21,FALSE)","v":0},{"$f":"VLOOKUP(A13,April!A:Z,17,FALSE)","v":0},{"$f":"VLOOKUP(A13,April!A:Z,18,FALSE)","v":0},{"$f":"VLOOKUP(A13,April!A:AA,20,FALSE)","v":0},{"$f":"VLOOKUP(A13,April!A:AB,26,FALSE)","v":""},{"$f":"VLOOKUP(A13,April!A:AC,25,FALSE)","v":0}]
["7.4.",{"$f":"VLOOKUP(A14,April!A:Z,2,FALSE)","v":"Fr"},{"$f":"VLOOKUP(A14,April!A:Y,21,FALSE)","v":0},{"$f":"VLOOKUP(A14,April!A:Z,17,FALSE)","v":0},{"$f":"VLOOKUP(A14,April!A:Z,18,FALSE)","v":0},{"$f":"VLOOKUP(A14,April!A:AA,20,FALSE)","v":0},{"$f":"VLOOKUP(A14,April!A:AB,26,FALSE)","v":""},{"$f":"VLOOKUP(A14,April!A:AC,25,FALSE)","v":0}]
["8.4.",{"$f":"VLOOKUP(A15,April!A:Z,2,FALSE)","v":"Sa"},{"$f":"VLOOKUP(A15,April!A:Y,21,FALSE)","v":0},{"$f":"VLOOKUP(A15,April!A:Z,17,FALSE)","v":0},{"$f":"VLOOKUP(A15,April!A:Z,18,FALSE)","v":0},{"$f":"VLOOKUP(A15,April!A:AA,20,FALSE)","v":0},{"$f":"VLOOKUP(A15,April!A:AB,26,FALSE)","v":""},{"$f":"VLOOKUP(A15,April!A:AC,25,FALSE)","v":0}]
["9.4.",{"$f":"VLOOKUP(A16,April!A:Z,2,FALSE)","v":"So"},{"$f":"VLOOKUP(A16,April!A:Y,21,FALSE)","v":0},{"$f":"VLOOKUP(A16,April!A:Z,17,FALSE)","v":0},{"$f":"VLOOKUP(A16,April!A:Z,18,FALSE)","v":0},{"$f":"VLOOKUP(A16,April!A:AA,20,FALSE)","v":0},{"$f":"VLOOKUP(A16,April!A:AB,26,FALSE)","v":""},{"$f":"VLOOKUP(A16,April!A:AC,25,FALSE)","v":0}]
["10.4.",{"$f":"VLOOKUP(A17,April!A:Z,2,FALSE)","v":"Mo"},{"$f":"VLOOKUP(A17,April!A:Y,21,FALSE)","v":0},{"$f":"VLOOKUP(A17,April!A:Z,17,FALSE)","v":0},{"$f":"VLOOKUP(A17,April!A:Z,18,FALSE)","v":0},{"$f":"VLOOKUP(A17,April!A:AA,20,FALSE)","v":0},{"$f":"VLOOKUP(A17,April!A:AB,26,FALSE)","v":""},{"$f":"VLOOKUP(A17,April!A:AC,25,FALSE)","v":0}]
["11.4.",{"$f":"VLOOKUP(A18,April!A:Z,2,FALSE)","v":"Die"},{"$f":"VLOOKUP(A18,April!A:Y,21,FALSE)","v":0},{"$f":"VLOOKUP(A18,April!A:Z,17,FALSE)","v":0},{"$f":"VLOOKUP(A18,April!A:Z,18,FALSE)","v":0},{"$f":"VLOOKUP(A18,April!A:AA,20,FALSE)","v":0},{"$f":"VLOOKUP(A18,April!A:AB,26,FALSE)","v":""},{"$f":"VLOOKUP(A18,April!A:AC,25,FALSE)","v":0}]
["12.4.",{"$f":"VLOOKUP(A19,April!A:Z,2,FALSE)","v":"Mi"},{"$f":"VLOOKUP(A19,April!A:Y,21,FALSE)","v":0},{"$f":"VLOOKUP(A19,April!A:Z,17,FALSE)","v":0},{"$f":"VLOOKUP(A19,April!A:Z,18,FALSE)","v":0},{"$f":"VLOOKUP(A19,April!A:AA,20,FALSE)","v":0},{"$f":"VLOOKUP(A19,April!A:AB,26,FALSE)","v":""},{"$f":"VLOOKUP(A19,April!A:AC,25,FALSE)","v":0}]
["13.4.",{"$f":"VLOOKUP(A20,April!A:Z,2,FALSE)","v":"Do"},{"$f":"VLOOKUP(A20,April!A:Y,21,FALSE)","v":0},{"$f":"VLOOKUP(A20,April!A:Z,17,FALSE)","v":0},{"$f":"VLOOKUP(A20,April!A:Z,18,FALSE)","v":0},{"$f":"VLOOKUP(A20,April!A:AA,20,FALSE)","v":0},{"$f":"VLOOKUP(A20,April!A:AB,26,FALSE)","v":""},{"$f":"VLOOKUP(A20,April!A:AC,25,FALSE)","v":0}]
["14.4.",{"$f":"VLOOKUP(A21,April!A:Z,2,FALSE)","v":"Fr"},{"$f":"VLOOKUP(A21,April!A:Y,21,FALSE)","v":0},{"$f":"VLOOKUP(A21,April!A:Z,17,FALSE)","v":0},{"$f":"VLOOKUP(A21,April!A:Z,18,FALSE)","v":0},{"$f":"VLOOKUP(A21,April!A:AA,20,FALSE)","v":0},{"$f":"VLOOKUP(A21,April!A:AB,26,FALSE)","v":""},{"$f":"VLOOKUP(A21,April!A:AC,25,FALSE)","v":0}]
["15.4.",{"$f":"VLOOKUP(A22,April!A:Z,2,FALSE)","v":"Sa"},{"$f":"VLOOKUP(A22,April!A:Y,21,FALSE)","v":0},{"$f":"VLOOKUP(A22,April!A:Z,17,FALSE)","v":0},{"$f":"VLOOKUP(A22,April!A:Z,18,FALSE)","v":0},{"$f":"VLOOKUP(A22,April!A:AA,20,FALSE)","v":0},{"$f":"VLOOKUP(A22,April!A:AB,26,FALSE)","v":""},{"$f":"VLOOKUP(A22,April!A:AC,25,FALSE)","v":0}]
["16.4.",{"$f":"VLOOKUP(A23,April!A:Z,2,FALSE)","v":"So"},{"$f":"VLOOKUP(A23,April!A:Y,21,FALSE)","v":0},{"$f":"VLOOKUP(A23,April!A:Z,17,FALSE)","v":0},{"$f":"VLOOKUP(A23,April!A:Z,18,FALSE)","v":0},{"$f":"VLOOKUP(A23,April!A:AA,20,FALSE)","v":0},{"$f":"VLOOKUP(A23,April!A:AB,26,FALSE)","v":""},{"$f":"VLOOKUP(A23,April!A:AC,25,FALSE)","v":0}]
["17.4.",{"$f":"VLOOKUP(A24,April!A:Z,2,FALSE)","v":"Mo"},{"$f":"VLOOKUP(A24,April!A:Y,21,FALSE)","v":0},{"$f":"VLOOKUP(A24,April!A:Z,17,FALSE)","v":0},{"$f":"VLOOKUP(A24,April!A:Z,18,FALSE)","v":0},{"$f":"VLOOKUP(A24,April!A:AA,20,FALSE)","v":0},{"$f":"VLOOKUP(A24,April!A:AB,26,FALSE)","v":""},{"$f":"VLOOKUP(A24,April!A:AC,25,FALSE)","v":0}]
["18.4.",{"$f":"VLOOKUP(A25,April!A:Z,2,FALSE)","v":"Die"},{"$f":"VLOOKUP(A25,April!A:Y,21,FALSE)","v":0},{"$f":"VLOOKUP(A25,April!A:Z,17,FALSE)","v":0},{"$f":"VLOOKUP(A25,April!A:Z,18,FALSE)","v":0},{"$f":"VLOOKUP(A25,April!A:AA,20,FALSE)","v":0},{"$f":"VLOOKUP(A25,April!A:AB,26,FALSE)","v":""},{"$f":"VLOOKUP(A25,April!A:AC,25,FALSE)","v":0}]
["19.4.",{"$f":"VLOOKUP(A26,April!A:Z,2,FALSE)","v":"Mi"},{"$f":"VLOOKUP(A26,April!A:Y,21,FALSE)","v":0},{"$f":"VLOOKUP(A26,April!A:Z,17,FALSE)","v":0},{"$f":"VLOOKUP(A26,April!A:Z,18,FALSE)","v":0},{"$f":"VLOOKUP(A26,April!A:AA,20,FALSE)","v":0},{"$f":"VLOOKUP(A26,April!A:AB,26,FALSE)","v":""},{"$f":"VLOOKUP(A26,April!A:AC,25,FALSE)","v":0}]
["20.4.",{"$f":"VLOOKUP(A27,April!A:Z,2,FALSE)","v":"Do"},{"$f":"VLOOKUP(A27,April!A:Y,21,FALSE)","v":0},{"$f":"VLOOKUP(A27,April!A:Z,17,FALSE)","v":0},{"$f":"VLOOKUP(A27,April!A:Z,18,FALSE)","v":0},{"$f":"VLOOKUP(A27,April!A:AA,20,FALSE)","v":0},{"$f":"VLOOKUP(A27,April!A:AB,26,FALSE)","v":""},{"$f":"VLOOKUP(A27,April!A:AC,25,FALSE)","v":0}]
["21.4.",{"$f":"VLOOKUP(A28,April!A:Z,2,FALSE)","v":"Fr"},{"$f":"VLOOKUP(A28,April!A:Y,21,FALSE)","v":0},{"$f":"VLOOKUP(A28,April!A:Z,17,FALSE)","v":0},{"$f":"VLOOKUP(A28,April!A:Z,18,FALSE)","v":0},{"$f":"VLOOKUP(A28,April!A:AA,20,FALSE)","v":0},{"$f":"VLOOKUP(A28,April!A:AB,26,FALSE)","v":""},{"$f":"VLOOKUP(A28,April!A:AC,25,FALSE)","v":0}]
["22.4.",{"$f":"VLOOKUP(A29,April!A:Z,2,FALSE)","v":"Sa"},{"$f":"VLOOKUP(A29,April!A:Y,21,FALSE)","v":0},{"$f":"VLOOKUP(A29,April!A:Z,17,FALSE)","v":0},{"$f":"VLOOKUP(A29,April!A:Z,18,FALSE)","v":0},{"$f":"VLOOKUP(A29,April!A:AA,20,FALSE)","v":0},{"$f":"VLOOKUP(A29,April!A:AB,26,FALSE)","v":""},{"$f":"VLOOKUP(A29,April!A:AC,25,FALSE)","v":0}]
["23.4.",{"$f":"VLOOKUP(A30,April!A:Z,2,FALSE)","v":"So"},{"$f":"VLOOKUP(A30,April!A:Y,21,FALSE)","v":0},{"$f":"VLOOKUP(A30,April!A:Z,17,FALSE)","v":0},{"$f":"VLOOKUP(A30,April!A:Z,18,FALSE)","v":0},{"$f":"VLOOKUP(A30,April!A:AA,20,FALSE)","v":0},{"$f":"VLOOKUP(A30,April!A:AB,26,FALSE)","v":""},{"$f":"VLOOKUP(A30,April!A:AC,25,FALSE)","v":0}]
["24.4.",{"$f":"VLOOKUP(A31,April!A:Z,2,FALSE)","v":"Mo"},{"$f":"VLOOKUP(A31,April!A:Y,21,FALSE)","v":0},{"$f":"VLOOKUP(A31,April!A:Z,17,FALSE)","v":0},{"$f":"VLOOKUP(A31,April!A:Z,18,FALSE)","v":0},{"$f":"VLOOKUP(A31,April!A:AA,20,FALSE)","v":0},{"$f":"VLOOKUP(A31,April!A:AB,26,FALSE)","v":""},{"$f":"VLOOKUP(A31,April!A:AC,25,FALSE)","v":0}]
["25.4.",{"$f":"VLOOKUP(A32,April!A:Z,2,FALSE)","v":"Die"},{"$f":"VLOOKUP(A32,April!A:Y,21,FALSE)","v":0},{"$f":"VLOOKUP(A32,April!A:Z,17,FALSE)","v":0},{"$f":"VLOOKUP(A32,April!A:Z,18,FALSE)","v":0},{"$f":"VLOOKUP(A32,April!A:AA,20,FALSE)","v":0},{"$f":"VLOOKUP(A32,April!A:AB,26,FALSE)","v":""},{"$f":"VLOOKUP(A32,April!A:AC,25,FALSE)","v":0}]
["26.4.",{"$f":"VLOOKUP(A33,April!A:Z,2,FALSE)","v":"Mi"},{"$f":"VLOOKUP(A33,April!A:Y,21,FALSE)","v":0},{"$f":"VLOOKUP(A33,April!A:Z,17,FALSE)","v":0},{"$f":"VLOOKUP(A33,April!A:Z,18,FALSE)","v":0},{"$f":"VLOOKUP(A33,April!A:AA,20,FALSE)","v":0},{"$f":"VLOOKUP(A33,April!A:AB,26,FALSE)","v":""},{"$f":"VLOOKUP(A33,April!A:AC,25,FALSE)","v":0}]
["27.4.",{"$f":"VLOOKUP(A34,April!A:Z,2,FALSE)","v":"Do"},{"$f":"VLOOKUP(A34,April!A:Y,21,FALSE)","v":0},{"$f":"VLOOKUP(A34,April!A:Z,17,FALSE)","v":0},{"$f":"VLOOKUP(A34,April!A:Z,18,FALSE)","v":0},{"$f":"VLOOKUP(A34,April!A:AA,20,FALSE)","v":0},{"$f":"VLOOKUP(A34,April!A:AB,26,FALSE)","v":""},{"$f":"VLOOKUP(A34,April!A:AC,25,FALSE)","v":0}]
["28.4.",{"$f":"VLOOKUP(A35,April!A:Z,2,FALSE)","v":"Fr"},{"$f":"VLOOKUP(A35,April!A:Y,21,FALSE)","v":0},{"$f":"VLOOKUP(A35,April!A:Z,17,FALSE)","v":0},{"$f":"VLOOKUP(A35,April!A:Z,18,FALSE)","v":0},{"$f":"VLOOKUP(A35,April!A:AA,20,FALSE)","v":0},{"$f":"VLOOKUP(A35,April!A:AB,26,FALSE)","v":""},{"$f":"VLOOKUP(A35,April!A:AC,25,FALSE)","v":0}]
["29.4.",{"$f":"VLOOKUP(A36,April!A:Z,2,FALSE)","v":"Sa"},{"$f":"VLOOKUP(A36,April!A:Y,21,FALSE)","v":0},{"$f":"VLOOKUP(A36,April!A:Z,17,FALSE)","v":0},{"$f":"VLOOKUP(A36,April!A:Z,18,FALSE)","v":0},{"$f":"VLOOKUP(A36,April!A:AA,20,FALSE)","v":0},{"$f":"VLOOKUP(A36,April!A:AB,26,FALSE)","v":""},{"$f":"VLOOKUP(A36,April!A:AC,25,FALSE)","v":0}]
["30.4.",{"$f":"VLOOKUP(A37,April!A:Z,2,FALSE)","v":"So"},{"$f":"VLOOKUP(A37,April!A:Y,21,FALSE)","v":0},{"$f":"VLOOKUP(A37,April!A:Z,17,FALSE)","v":0},{"$f":"VLOOKUP(A37,April!A:Z,18,FALSE)","v":0},{"$f":"VLOOKUP(A37,April!A:AA,20,FALSE)","v":0},{"$f":"VLOOKUP(A37,April!A:AB,26,FALSE)","v":""},{"$f":"VLOOKUP(A37,April!A:AC,25,FALSE)","v":0}]
[]
["1) Die Anzeige von \"Fehler\" in Spalte G erscheint, wenn im Arbeitsblatt des entsprechenden Monats: 1. Arbeitszeit und Urlaub erfasst wurde;  2. Urlaub und Krankheit jeweils eingegeben wurde und wenn 3. in der Erfassungstabelle (Monat) an Krankheitstagen Arbeitszeit eingetragen wurde.    Hintergrund: Im Urlaub oder bei Krankheit kann nicht gearbeitet werden."]
["2) An Krankheitstagen erscheint in dieser Tabelle dennoch eine Zahl bei der Arbeitszeit. Krankheit wird in AZ umgerechnet und erhöht die IST-AZ.; Bei der \"Fehler\"anzeige wurde Arbeitszeit in den Spalten C bis O (Monatsblatt) eingetragen."]
[]
["Zum Arbeitsblatt:",null,null,"APRIL"]

{"sheet":"Mai-Druck","index":21,"n_rows":43,"n_cols":8,"rows_kept":43,"cut":false,"hidden":false,"merged":[[42,0,42,2],[42,3,42,4],[0,0,0,1],[2,6,5,6],[5,0,5,1],[39,0,39,7],[40,0,40,7]]}
[{"$f":"Mai!V1","v":"MAI"},null,{"$f":"Stammdaten!C2","v":2023},null,null,null,null,{"$f":"Stammdaten!B3","v":0}]
["JAZ",null,{"$f":"Stammdaten!B26","v":1287}]
["Jahres-IST",null,{"$f":"Mai!U5","v":0}]
["Verbleibende AZ",null,{"$f":"Mai!W44","v":1287}]
["Urlaub im Monat",null,{"$f":"Mai!Q45","v":0}]
["Resturlaub zum Ende des Monats",null,{"$f":"Mai!Q5","v":30}]
["Datum","Tag","AZ","Urlaub","Krank/\nFreistellung","Ort","Plausibilität","Anmerkungen"]
["1.5.",{"$f":"VLOOKUP(A8,Mai!A:Z,2,FALSE)","v":"Mo"},{"$f":"VLOOKUP(A8,Mai!A:Y,21,FALSE)","v":0},{"$f":"VLOOKUP(A8,Mai!A:Z,17,FALSE)","v":0},{"$f":"VLOOKUP(A8,Mai!A:Z,18,FALSE)","v":0},{"$f":"VLOOKUP(A8,Mai!A:AA,20,FALSE)","v":0},{"$f":"VLOOKUP(A8,Mai!A:AB,26,FALSE)","v":""},{"$f":"VLOOKUP(A8,Mai!A:AC,25,FALSE)","v":0}]
["2.5.",{"$f":"VLOOKUP(A9,Mai!A:Z,2,FALSE)","v":"Die"},{"$f":"VLOOKUP(A9,Mai!A:Y,21,FALSE)","v":0},{"$f":"VLOOKUP(A9,Mai!A:Z,17,FALSE)","v":0},{"$f":"VLOOKUP(A9,Mai!A:Z,18,FALSE)","v":0},{"$f":"VLOOKUP(A9,Mai!A:AA,20,FALSE)","v":0},{"$f":"VLOOKUP(A9,Mai!A:AB,26,FALSE)","v":""},{"$f":"VLOOKUP(A9,Mai!A:AC,25,FALSE)","v":0}]
["3.5.",{"$f":"VLOOKUP(A10,Mai!A:Z,2,FALSE)","v":"Mi"},{"$f":"VLOOKUP(A10,Mai!A:Y,21,FALSE)","v":0},{"$f":"VLOOKUP(A10,Mai!A:Z,17,FALSE)","v":0},{"$f":"VLOOKUP(A10,Mai!A:Z,18,FALSE)","v":0},{"$f":"VLOOKUP(A10,Mai!A:AA,20,FALSE)","v":0},{"$f":"VLOOKUP(A10,Mai!A:AB,26,FALSE)","v":""},{"$f":"VLOOKUP(A10,Mai!A:AC,25,FALSE)","v":0}]
["4.5.",{"$f":"VLOOKUP(A11,Mai!A:Z,2,FALSE)","v":"Do"},{"$f":"VLOOKUP(A11,Mai!A:Y,21,FALSE)","v":0},{"$f":"VLOOKUP(A11,Mai!A:Z,17,FALSE)","v":0},{"$f":"VLOOKUP(A11,Mai!A:Z,18,FALSE)","v":0},{"$f":"VLOOKUP(A11,Mai!A:AA,20,FALSE)","v":0},{"$f":"VLOOKUP(A11,Mai!A:AB,26,FALSE)","v":""},{"$f":"VLOOKUP(A11,Mai!A:AC,25,FALSE)","v":0}]
["5.5.",{"$f":"VLOOKUP(A12,Mai!A:Z,2,FALSE)","v":"Fr"},{"$f":"VLOOKUP(A12,Mai!A:Y,21,FALSE)","v":0},{"$f":"VLOOKUP(A12,Mai!A:Z,17,FALSE)","v":0},{"$f":"VLOOKUP(A12,Mai!A:Z,18,FALSE)","v":0},{"$f":"VLOOKUP(A12,Mai!A:AA,20,FALSE)","v":0},{"$f":"VLOOKUP(A12,Mai!A:AB,26,FALSE)","v":""},{"$f":"VLOOKUP(A12,Mai!A:AC,25,FALSE)","v":0}]
["6.5.",{"$f":"VLOOKUP(A13,Mai!A:Z,2,FALSE)","v":"Sa"},{"$f":"VLOOKUP(A13,Mai!A:Y,21,FALSE)","v":0},{"$f":"VLOOKUP(A13,Mai!A:Z,17,FALSE)","v":0},{"$f":"VLOOKUP(A13,Mai!A:Z,18,FALSE)","v":0},{"$f":"VLOOKUP(A13,Mai!A:AA,20,FALSE)","v":0},{"$f":"VLOOKUP(A13,Mai!A:AB,26,FALSE)","v":""},{"$f":"VLOOKUP(A13,Mai!A:AC,25,FALSE)","v":0}]
["7.5.",{"$f":"VLOOKUP(A14,Mai!A:Z,2,FALSE)","v":"So"},{"$f":"VLOOKUP(A14,Mai!A:Y,21,FALSE)","v":0},{"$f":"VLOOKUP(A14,Mai!A:Z,17,FALSE)","v":0},{"$f":"VLOOKUP(A14,Mai!A:Z,18,FALSE)","v":0},{"$f":"VLOOKUP(A14,Mai!A:AA,20,FALSE)","v":0},{"$f":"VLOOKUP(A14,Mai!A:AB,26,FALSE)","v":""},{"$f":"VLOOKUP(A14,Mai!A:AC,25,FALSE)","v":0}]
["8.5.",{"$f":"VLOOKUP(A15,Mai!A:Z,2,FALSE)","v":"Mo"},{"$f":"VLOOKUP(A15,Mai!A:Y,21,FALSE)","v":0},{"$f":"VLOOKUP(A15,Mai!A:Z,17,FALSE)","v":0},{"$f":"VLOOKUP(A15,Mai!A:Z,18,FALSE)","v":0},{"$f":"VLOOKUP(A15,Mai!A:AA,20,FALSE)","v":0},{"$f":"VLOOKUP(A15,Mai!A:AB,26,FALSE)","v":""},{"$f":"VLOOKUP(A15,Mai!A:AC,25,FALSE)","v":0}]
["9.5.",{"$f":"VLOOKUP(A16,Mai!A:Z,2,FALSE)","v":"Die"},{"$f":"VLOOKUP(A16,Mai!A:Y,21,FALSE)","v":0},{"$f":"VLOOKUP(A16,Mai!A:Z,17,FALSE)","v":0},{"$f":"VLOOKUP(A16,Mai!A:Z,18,FALSE)","v":0},{"$f":"VLOOKUP(A16,Mai!A:AA,20,FALSE)","v":0},{"$f":"VLOOKUP(A16,Mai!A:AB,26,FALSE)","v":""},{"$f":"VLOOKUP(A16,Mai!A:AC,25,FALSE)","v":0}]
["10.5.",{"$f":"VLOOKUP(A17,Mai!A:Z,2,FALSE)","v":"Mi"},{"$f":"VLOOKUP(A17,Mai!A:Y,21,FALSE)","v":0},{"$f":"VLOOKUP(A17,Mai!A:Z,17,FALSE)","v":0},{"$f":"VLOOKUP(A17,Mai!A:Z,18,FALSE)","v":0},{"$f":"VLOOKUP(A17,Mai!A:AA,20,FALSE)","v":0},{"$f":"VLOOKUP(A17,Mai!A:AB,26,FALSE)","v":""},{"$f":"VLOOKUP(A17,Mai!A:AC,25,FALSE)","v":0}]
["11.5.",{"$f":"VLOOKUP(A18,Mai!A:Z,2,FALSE)","v":"Do"},{"$f":"VLOOKUP(A18,Mai!A:Y,21,FALSE)","v":0},{"$f":"VLOOKUP(A18,Mai!A:Z,17,FALSE)","v":0},{"$f":"VLOOKUP(A18,Mai!A:Z,18,FALSE)","v":0},{"$f":"VLOOKUP(A18,Mai!A:AA,20,FALSE)","v":0},{"$f":"VLOOKUP(A18,Mai!A:AB,26,FALSE)","v":""},{"$f":"VLOOKUP(A18,Mai!A:AC,25,FALSE)","v":0}]
["12.5.",{"$f":"VLOOKUP(A19,Mai!A:Z,2,FALSE)","v":"Fr"},{"$f":"VLOOKUP(A19,Mai!A:Y,21,FALSE)","v":0},{"$f":"VLOOKUP(A19,Mai!A:Z,17,FALSE)","v":0},{"$f":"VLOOKUP(A19,Mai!A:Z,18,FALSE)","v":0},{"$f":"VLOOKUP(A19,Mai!A:AA,20,FALSE)","v":0},{"$f":"VLOOKUP(A19,Mai!A:AB,26,FALSE)","v":""},{"$f":"VLOOKUP(A19,Mai!A:AC,25,FALSE)","v":0}]
["13.5.",{"$f":"VLOOKUP(A20,Mai!A:Z,2,FALSE)","v":"Sa"},{"$f":"VLOOKUP(A20,Mai!A:Y,21,FALSE)","v":0},{"$f":"VLOOKUP(A20,Mai!A:Z,17,FALSE)","v":0},{"$f":"VLOOKUP(A20,Mai!A:Z,18,FALSE)","v":0},{"$f":"VLOOKUP(A20,Mai!A:AA,20,FALSE)","v":0},{"$f":"VLOOKUP(A20,Mai!A:AB,26,FALSE)","v":""},{"$f":"VLOOKUP(A20,Mai!A:AC,25,FALSE)","v":0}]
["14.5.",{"$f":"VLOOKUP(A21,Mai!A:Z,2,FALSE)","v":"So"},{"$f":"VLOOKUP(A21,Mai!A:Y,21,FALSE)","v":0},{"$f":"VLOOKUP(A21,Mai!A:Z,17,FALSE)","v":0},{"$f":"VLOOKUP(A21,Mai!A:Z,18,FALSE)","v":0},{"$f":"VLOOKUP(A21,Mai!A:AA,20,FALSE)","v":0},{"$f":"VLOOKUP(A21,Mai!A:AB,26,FALSE)","v":""},{"$f":"VLOOKUP(A21,Mai!A:AC,25,FALSE)","v":0}]
["15.5.",{"$f":"VLOOKUP(A22,Mai!A:Z,2,FALSE)","v":"Mo"},{"$f":"VLOOKUP(A22,Mai!A:Y,21,FALSE)","v":0},{"$f":"VLOOKUP(A22,Mai!A:Z,17,FALSE)","v":0},{"$f":"VLOOKUP(A22,Mai!A:Z,18,FALSE)","v":0},{"$f":"VLOOKUP(A22,Mai!A:AA,20,FALSE)","v":0},{"$f":"VLOOKUP(A22,Mai!A:AB,26,FALSE)","v":""},{"$f":"VLOOKUP(A22,Mai!A:AC,25,FALSE)","v":0}]
["16.5.",{"$f":"VLOOKUP(A23,Mai!A:Z,2,FALSE)","v":"Die"},{"$f":"VLOOKUP(A23,Mai!A:Y,21,FALSE)","v":0},{"$f":"VLOOKUP(A23,Mai!A:Z,17,FALSE)","v":0},{"$f":"VLOOKUP(A23,Mai!A:Z,18,FALSE)","v":0},{"$f":"VLOOKUP(A23,Mai!A:AA,20,FALSE)","v":0},{"$f":"VLOOKUP(A23,Mai!A:AB,26,FALSE)","v":""},{"$f":"VLOOKUP(A23,Mai!A:AC,25,FALSE)","v":0}]
["17.5.",{"$f":"VLOOKUP(A24,Mai!A:Z,2,FALSE)","v":"Mi"},{"$f":"VLOOKUP(A24,Mai!A:Y,21,FALSE)","v":0},{"$f":"VLOOKUP(A24,Mai!A:Z,17,FALSE)","v":0},{"$f":"VLOOKUP(A24,Mai!A:Z,18,FALSE)","v":0},{"$f":"VLOOKUP(A24,Mai!A:AA,20,FALSE)","v":0},{"$f":"VLOOKUP(A24,Mai!A:AB,26,FALSE)","v":""},{"$f":"VLOOKUP(A24,Mai!A:AC,25,FALSE)","v":0}]
["18.5.",{"$f":"VLOOKUP(A25,Mai!A:Z,2,FALSE)","v":"Do"},{"$f":"VLOOKUP(A25,Mai!A:Y,21,FALSE)","v":0},{"$f":"VLOOKUP(A25,Mai!A:Z,17,FALSE)","v":0},{"$f":"VLOOKUP(A25,Mai!A:Z,18,FALSE)","v":0},{"$f":"VLOOKUP(A25,Mai!A:AA,20,FALSE)","v":0},{"$f":"VLOOKUP(A25,Mai!A:AB,26,FALSE)","v":""},{"$f":"VLOOKUP(A25,Mai!A:AC,25,FALSE)","v":0}]
["19.5.",{"$f":"VLOOKUP(A26,Mai!A:Z,2,FALSE)","v":"Fr"},{"$f":"VLOOKUP(A26,Mai!A:Y,21,FALSE)","v":0},{"$f":"VLOOKUP(A26,Mai!A:Z,17,FALSE)","v":0},{"$f":"VLOOKUP(A26,Mai!A:Z,18,FALSE)","v":0},{"$f":"VLOOKUP(A26,Mai!A:AA,20,FALSE)","v":0},{"$f":"VLOOKUP(A26,Mai!A:AB,26,FALSE)","v":""},{"$f":"VLOOKUP(A26,Mai!A:AC,25,FALSE)","v":0}]
["20.5.",{"$f":"VLOOKUP(A27,Mai!A:Z,2,FALSE)","v":"Sa"},{"$f":"VLOOKUP(A27,Mai!A:Y,21,FALSE)","v":0},{"$f":"VLOOKUP(A27,Mai!A:Z,17,FALSE)","v":0},{"$f":"VLOOKUP(A27,Mai!A:Z,18,FALSE)","v":0},{"$f":"VLOOKUP(A27,Mai!A:AA,20,FALSE)","v":0},{"$f":"VLOOKUP(A27,Mai!A:AB,26,FALSE)","v":""},{"$f":"VLOOKUP(A27,Mai!A:AC,25,FALSE)","v":0}]
["21.5.",{"$f":"VLOOKUP(A28,Mai!A:Z,2,FALSE)","v":"So"},{"$f":"VLOOKUP(A28,Mai!A:Y,21,FALSE)","v":0},{"$f":"VLOOKUP(A28,Mai!A:Z,17,FALSE)","v":0},{"$f":"VLOOKUP(A28,Mai!A:Z,18,FALSE)","v":0},{"$f":"VLOOKUP(A28,Mai!A:AA,20,FALSE)","v":0},{"$f":"VLOOKUP(A28,Mai!A:AB,26,FALSE)","v":""},{"$f":"VLOOKUP(A28,Mai!A:AC,25,FALSE)","v":0}]
["22.5.",{"$f":"VLOOKUP(A29,Mai!A:Z,2,FALSE)","v":"Mo"},{"$f":"VLOOKUP(A29,Mai!A:Y,21,FALSE)","v":0},{"$f":"VLOOKUP(A29,Mai!A:Z,17,FALSE)","v":0},{"$f":"VLOOKUP(A29,Mai!A:Z,18,FALSE)","v":0},{"$f":"VLOOKUP(A29,Mai!A:AA,20,FALSE)","v":0},{"$f":"VLOOKUP(A29,Mai!A:AB,26,FALSE)","v":""},{"$f":"VLOOKUP(A29,Mai!A:AC,25,FALSE)","v":0}]
["23.5.",{"$f":"VLOOKUP(A30,Mai!A:Z,2,FALSE)","v":"Die"},{"$f":"VLOOKUP(A30,Mai!A:Y,21,FALSE)","v":0},{"$f":"VLOOKUP(A30,Mai!A:Z,17,FALSE)","v":0},{"$f":"VLOOKUP(A30,Mai!A:Z,18,FALSE)","v":0},{"$f":"VLOOKUP(A30,Mai!A:AA,20,FALSE)","v":0},{"$f":"VLOOKUP(A30,Mai!A:AB,26,FALSE)","v":""},{"$f":"VLOOKUP(A30,Mai!A:AC,25,FALSE)","v":0}]
["24.5.",{"$f":"VLOOKUP(A31,Mai!A:Z,2,FALSE)","v":"Mi"},{"$f":"VLOOKUP(A31,Mai!A:Y,21,FALSE)","v":0},{"$f":"VLOOKUP(A31,Mai!A:Z,17,FALSE)","v":0},{"$f":"VLOOKUP(A31,Mai!A:Z,18,FALSE)","v":0},{"$f":"VLOOKUP(A31,Mai!A:AA,20,FALSE)","v":0},{"$f":"VLOOKUP(A31,Mai!A:AB,26,FALSE)","v":""},{"$f":"VLOOKUP(A31,Mai!A:AC,25,FALSE)","v":0}]
["25.5.",{"$f":"VLOOKUP(A32,Mai!A:Z,2,FALSE)","v":"Do"},{"$f":"VLOOKUP(A32,Mai!A:Y,21,FALSE)","v":0},{"$f":"VLOOKUP(A32,Mai!A:Z,17,FALSE)","v":0},{"$f":"VLOOKUP(A32,Mai!A:Z,18,FALSE)","v":0},{"$f":"VLOOKUP(A32,Mai!A:AA,20,FALSE)","v":0},{"$f":"VLOOKUP(A32,Mai!A:AB,26,FALSE)","v":""},{"$f":"VLOOKUP(A32,Mai!A:AC,25,FALSE)","v":0}]
["26.5.",{"$f":"VLOOKUP(A33,Mai!A:Z,2,FALSE)","v":"Fr"},{"$f":"VLOOKUP(A33,Mai!A:Y,21,FALSE)","v":0},{"$f":"VLOOKUP(A33,Mai!A:Z,17,FALSE)","v":0},{"$f":"VLOOKUP(A33,Mai!A:Z,18,FALSE)","v":0},{"$f":"VLOOKUP(A33,Mai!A:AA,20,FALSE)","v":0},{"$f":"VLOOKUP(A33,Mai!A:AB,26,FALSE)","v":""},{"$f":"VLOOKUP(A33,Mai!A:AC,25,FALSE)","v":0}]
["27.5.",{"$f":"VLOOKUP(A34,Mai!A:Z,2,FALSE)","v":"Sa"},{"$f":"VLOOKUP(A34,Mai!A:Y,21,FALSE)","v":0},{"$f":"VLOOKUP(A34,Mai!A:Z,17,FALSE)","v":0},{"$f":"VLOOKUP(A34,Mai!A:Z,18,FALSE)","v":0},{"$f":"VLOOKUP(A34,Mai!A:AA,20,FALSE)","v":0},{"$f":"VLOOKUP(A34,Mai!A:AB,26,FALSE)","v":""},{"$f":"VLOOKUP(A34,Mai!A:AC,25,FALSE)","v":0}]
["28.5.",{"$f":"VLOOKUP(A35,Mai!A:Z,2,FALSE)","v":"So"},{"$f":"VLOOKUP(A35,Mai!A:Y,21,FALSE)","v":0},{"$f":"VLOOKUP(A35,Mai!A:Z,17,FALSE)","v":0},{"$f":"VLOOKUP(A35,Mai!A:Z,18,FALSE)","v":0},{"$f":"VLOOKUP(A35,Mai!A:AA,20,FALSE)","v":0},{"$f":"VLOOKUP(A35,Mai!A:AB,26,FALSE)","v":""},{"$f":"VLOOKUP(A35,Mai!A:AC,25,FALSE)","v":0}]
["29.5.",{"$f":"VLOOKUP(A36,Mai!A:Z,2,FALSE)","v":"Mo"},{"$f":"VLOOKUP(A36,Mai!A:Y,21,FALSE)","v":0},{"$f":"VLOOKUP(A36,Mai!A:Z,17,FALSE)","v":0},{"$f":"VLOOKUP(A36,Mai!A:Z,18,FALSE)","v":0},{"$f":"VLOOKUP(A36,Mai!A:AA,20,FALSE)","v":0},{"$f":"VLOOKUP(A36,Mai!A:AB,26,FALSE)","v":""},{"$f":"VLOOKUP(A36,Mai!A:AC,25,FALSE)","v":0}]
["30.5.",{"$f":"VLOOKUP(A37,Mai!A:Z,2,FALSE)","v":"Die"},{"$f":"VLOOKUP(A37,Mai!A:Y,21,FALSE)","v":0},{"$f":"VLOOKUP(A37,Mai!A:Z,17,FALSE)","v":0},{"$f":"VLOOKUP(A37,Mai!A:Z,18,FALSE)","v":0},{"$f":"VLOOKUP(A37,Mai!A:AA,20,FALSE)","v":0},{"$f":"VLOOKUP(A37,Mai!A:AB,26,FALSE)","v":""},{"$f":"VLOOKUP(A37,Mai!A:AC,25,FALSE)","v":0}]
["31.5.",{"$f":"VLOOKUP(A38,Mai!A:Z,2,FALSE)","v":"Mi"},{"$f":"VLOOKUP(A38,Mai!A:Y,21,FALSE)","v":0},{"$f":"VLOOKUP(A38,Mai!A:Z,17,FALSE)","v":0},{"$f":"VLOOKUP(A38,Mai!A:Z,18,FALSE)","v":0},{"$f":"VLOOKUP(A38,Mai!A:AA,20,FALSE)","v":0},{"$f":"VLOOKUP(A38,Mai!A:AB,26,FALSE)","v":""},{"$f":"VLOOKUP(A38,Mai!A:AC,25,FALSE)","v":0}]
[]
["1) Die Anzeige von \"Fehler\" in Spalte G erscheint, wenn im Arbeitsblatt des entsprechenden Monats: 1. Arbeitszeit und Urlaub erfasst wurde;  2. Urlaub und Krankheit jeweils eingegeben wurde und wenn 3. in der Erfassungstabelle (Monat) an Krankheitstagen Arbeitszeit eingetragen wurde.    Hintergrund: Im Urlaub oder bei Krankheit kann nicht gearbeitet werden."]
["2) An Krankheitstagen erscheint in dieser Tabelle dennoch eine Zahl bei der Arbeitszeit. Krankheit wird in AZ umgerechnet und erhöht die IST-AZ.; Bei der \"Fehler\"anzeige wurde Arbeitszeit in den Spalten C bis O (Monatsblatt) eingetragen."]
[]
["Zum Arbeitsblatt:",null,null,"MAI"]

{"sheet":"Juni-Druck","index":22,"n_rows":42,"n_cols":8,"rows_kept":42,"cut":false,"hidden":false,"merged":[[41,0,41,2],[41,3,41,4],[0,0,0,1],[2,6,5,6],[5,0,5,1],[38,0,38,7],[39,0,39,7]]}
[{"$f":"Juni!V1","v":"JUNI"},null,{"$f":"Stammdaten!C2","v":2023},null,null,null,null,{"$f":"Stammdaten!B3","v":0}]
["JAZ",null,{"$f":"Stammdaten!B26","v":1287}]
["Jahres-IST",null,{"$f":"Juni!U5","v":0}]
["Verbleibende AZ",null,{"$f":"Juni!W44","v":1287}]
["Urlaub im Monat",null,{"$f":"Juni!Q45","v":0}]
["Resturlaub zum Ende des Monats",null,{"$f":"Juni!Q5","v":30}]
["Datum","Tag","AZ","Urlaub","Krank/\nFreistellung","Ort","Plausibilität","Anmerkungen"]
["1.6.",{"$f":"VLOOKUP(A8,Juni!A:Z,2,FALSE)","v":"Do"},{"$f":"VLOOKUP(A8,Juni!A:Y,21,FALSE)","v":0},{"$f":"VLOOKUP(A8,Juni!A:Z,17,FALSE)","v":0},{"$f":"VLOOKUP(A8,Juni!A:Z,18,FALSE)","v":0},{"$f":"VLOOKUP(A8,Juni!A:AA,20,FALSE)","v":0},{"$f":"VLOOKUP(A8,Juni!A:AB,26,FALSE)","v":""},{"$f":"VLOOKUP(A8,Juni!A:AC,25,FALSE)","v":0}]
["2.6.",{"$f":"VLOOKUP(A9,Juni!A:Z,2,FALSE)","v":"Fr"},{"$f":"VLOOKUP(A9,Juni!A:Y,21,FALSE)","v":0},{"$f":"VLOOKUP(A9,Juni!A:Z,17,FALSE)","v":0},{"$f":"VLOOKUP(A9,Juni!A:Z,18,FALSE)","v":0},{"$f":"VLOOKUP(A9,Juni!A:AA,20,FALSE)","v":0},{"$f":"VLOOKUP(A9,Juni!A:AB,26,FALSE)","v":""},{"$f":"VLOOKUP(A9,Juni!A:AC,25,FALSE)","v":0}]
["3.6.",{"$f":"VLOOKUP(A10,Juni!A:Z,2,FALSE)","v":"Sa"},{"$f":"VLOOKUP(A10,Juni!A:Y,21,FALSE)","v":0},{"$f":"VLOOKUP(A10,Juni!A:Z,17,FALSE)","v":0},{"$f":"VLOOKUP(A10,Juni!A:Z,18,FALSE)","v":0},{"$f":"VLOOKUP(A10,Juni!A:AA,20,FALSE)","v":0},{"$f":"VLOOKUP(A10,Juni!A:AB,26,FALSE)","v":""},{"$f":"VLOOKUP(A10,Juni!A:AC,25,FALSE)","v":0}]
["4.6.",{"$f":"VLOOKUP(A11,Juni!A:Z,2,FALSE)","v":"So"},{"$f":"VLOOKUP(A11,Juni!A:Y,21,FALSE)","v":0},{"$f":"VLOOKUP(A11,Juni!A:Z,17,FALSE)","v":0},{"$f":"VLOOKUP(A11,Juni!A:Z,18,FALSE)","v":0},{"$f":"VLOOKUP(A11,Juni!A:AA,20,FALSE)","v":0},{"$f":"VLOOKUP(A11,Juni!A:AB,26,FALSE)","v":""},{"$f":"VLOOKUP(A11,Juni!A:AC,25,FALSE)","v":0}]
["5.6.",{"$f":"VLOOKUP(A12,Juni!A:Z,2,FALSE)","v":"Mo"},{"$f":"VLOOKUP(A12,Juni!A:Y,21,FALSE)","v":0},{"$f":"VLOOKUP(A12,Juni!A:Z,17,FALSE)","v":0},{"$f":"VLOOKUP(A12,Juni!A:Z,18,FALSE)","v":0},{"$f":"VLOOKUP(A12,Juni!A:AA,20,FALSE)","v":0},{"$f":"VLOOKUP(A12,Juni!A:AB,26,FALSE)","v":""},{"$f":"VLOOKUP(A12,Juni!A:AC,25,FALSE)","v":0}]
["6.6.",{"$f":"VLOOKUP(A13,Juni!A:Z,2,FALSE)","v":"Die"},{"$f":"VLOOKUP(A13,Juni!A:Y,21,FALSE)","v":0},{"$f":"VLOOKUP(A13,Juni!A:Z,17,FALSE)","v":0},{"$f":"VLOOKUP(A13,Juni!A:Z,18,FALSE)","v":0},{"$f":"VLOOKUP(A13,Juni!A:AA,20,FALSE)","v":0},{"$f":"VLOOKUP(A13,Juni!A:AB,26,FALSE)","v":""},{"$f":"VLOOKUP(A13,Juni!A:AC,25,FALSE)","v":0}]
["7.6.",{"$f":"VLOOKUP(A14,Juni!A:Z,2,FALSE)","v":"Mi"},{"$f":"VLOOKUP(A14,Juni!A:Y,21,FALSE)","v":0},{"$f":"VLOOKUP(A14,Juni!A:Z,17,FALSE)","v":0},{"$f":"VLOOKUP(A14,Juni!A:Z,18,FALSE)","v":0},{"$f":"VLOOKUP(A14,Juni!A:AA,20,FALSE)","v":0},{"$f":"VLOOKUP(A14,Juni!A:AB,26,FALSE)","v":""},{"$f":"VLOOKUP(A14,Juni!A:AC,25,FALSE)","v":0}]
["8.6.",{"$f":"VLOOKUP(A15,Juni!A:Z,2,FALSE)","v":"Do"},{"$f":"VLOOKUP(A15,Juni!A:Y,21,FALSE)","v":0},{"$f":"VLOOKUP(A15,Juni!A:Z,17,FALSE)","v":0},{"$f":"VLOOKUP(A15,Juni!A:Z,18,FALSE)","v":0},{"$f":"VLOOKUP(A15,Juni!A:AA,20,FALSE)","v":0},{"$f":"VLOOKUP(A15,Juni!A:AB,26,FALSE)","v":""},{"$f":"VLOOKUP(A15,Juni!A:AC,25,FALSE)","v":0}]
["9.6.",{"$f":"VLOOKUP(A16,Juni!A:Z,2,FALSE)","v":"Fr"},{"$f":"VLOOKUP(A16,Juni!A:Y,21,FALSE)","v":0},{"$f":"VLOOKUP(A16,Juni!A:Z,17,FALSE)","v":0},{"$f":"VLOOKUP(A16,Juni!A:Z,18,FALSE)","v":0},{"$f":"VLOOKUP(A16,Juni!A:AA,20,FALSE)","v":0},{"$f":"VLOOKUP(A16,Juni!A:AB,26,FALSE)","v":""},{"$f":"VLOOKUP(A16,Juni!A:AC,25,FALSE)","v":0}]
["10.6.",{"$f":"VLOOKUP(A17,Juni!A:Z,2,FALSE)","v":"Sa"},{"$f":"VLOOKUP(A17,Juni!A:Y,21,FALSE)","v":0},{"$f":"VLOOKUP(A17,Juni!A:Z,17,FALSE)","v":0},{"$f":"VLOOKUP(A17,Juni!A:Z,18,FALSE)","v":0},{"$f":"VLOOKUP(A17,Juni!A:AA,20,FALSE)","v":0},{"$f":"VLOOKUP(A17,Juni!A:AB,26,FALSE)","v":""},{"$f":"VLOOKUP(A17,Juni!A:AC,25,FALSE)","v":0}]
["11.6.",{"$f":"VLOOKUP(A18,Juni!A:Z,2,FALSE)","v":"So"},{"$f":"VLOOKUP(A18,Juni!A:Y,21,FALSE)","v":0},{"$f":"VLOOKUP(A18,Juni!A:Z,17,FALSE)","v":0},{"$f":"VLOOKUP(A18,Juni!A:Z,18,FALSE)","v":0},{"$f":"VLOOKUP(A18,Juni!A:AA,20,FALSE)","v":0},{"$f":"VLOOKUP(A18,Juni!A:AB,26,FALSE)","v":""},{"$f":"VLOOKUP(A18,Juni!A:AC,25,FALSE)","v":0}]
["12.6.",{"$f":"VLOOKUP(A19,Juni!A:Z,2,FALSE)","v":"Mo"},{"$f":"VLOOKUP(A19,Juni!A:Y,21,FALSE)","v":0},{"$f":"VLOOKUP(A19,Juni!A:Z,17,FALSE)","v":0},{"$f":"VLOOKUP(A19,Juni!A:Z,18,FALSE)","v":0},{"$f":"VLOOKUP(A19,Juni!A:AA,20,FALSE)","v":0},{"$f":"VLOOKUP(A19,Juni!A:AB,26,FALSE)","v":""},{"$f":"VLOOKUP(A19,Juni!A:AC,25,FALSE)","v":0}]
["13.6.",{"$f":"VLOOKUP(A20,Juni!A:Z,2,FALSE)","v":"Die"},{"$f":"VLOOKUP(A20,Juni!A:Y,21,FALSE)","v":0},{"$f":"VLOOKUP(A20,Juni!A:Z,17,FALSE)","v":0},{"$f":"VLOOKUP(A20,Juni!A:Z,18,FALSE)","v":0},{"$f":"VLOOKUP(A20,Juni!A:AA,20,FALSE)","v":0},{"$f":"VLOOKUP(A20,Juni!A:AB,26,FALSE)","v":""},{"$f":"VLOOKUP(A20,Juni!A:AC,25,FALSE)","v":0}]
["14.6.",{"$f":"VLOOKUP(A21,Juni!A:Z,2,FALSE)","v":"Mi"},{"$f":"VLOOKUP(A21,Juni!A:Y,21,FALSE)","v":0},{"$f":"VLOOKUP(A21,Juni!A:Z,17,FALSE)","v":0},{"$f":"VLOOKUP(A21,Juni!A:Z,18,FALSE)","v":0},{"$f":"VLOOKUP(A21,Juni!A:AA,20,FALSE)","v":0},{"$f":"VLOOKUP(A21,Juni!A:AB,26,FALSE)","v":""},{"$f":"VLOOKUP(A21,Juni!A:AC,25,FALSE)","v":0}]
["15.6.",{"$f":"VLOOKUP(A22,Juni!A:Z,2,FALSE)","v":"Do"},{"$f":"VLOOKUP(A22,Juni!A:Y,21,FALSE)","v":0},{"$f":"VLOOKUP(A22,Juni!A:Z,17,FALSE)","v":0},{"$f":"VLOOKUP(A22,Juni!A:Z,18,FALSE)","v":0},{"$f":"VLOOKUP(A22,Juni!A:AA,20,FALSE)","v":0},{"$f":"VLOOKUP(A22,Juni!A:AB,26,FALSE)","v":""},{"$f":"VLOOKUP(A22,Juni!A:AC,25,FALSE)","v":0}]
["16.6.",{"$f":"VLOOKUP(A23,Juni!A:Z,2,FALSE)","v":"Fr"},{"$f":"VLOOKUP(A23,Juni!A:Y,21,FALSE)","v":0},{"$f":"VLOOKUP(A23,Juni!A:Z,17,FALSE)","v":0},{"$f":"VLOOKUP(A23,Juni!A:Z,18,FALSE)","v":0},{"$f":"VLOOKUP(A23,Juni!A:AA,20,FALSE)","v":0},{"$f":"VLOOKUP(A23,Juni!A:AB,26,FALSE)","v":""},{"$f":"VLOOKUP(A23,Juni!A:AC,25,FALSE)","v":0}]
["17.6.",{"$f":"VLOOKUP(A24,Juni!A:Z,2,FALSE)","v":"Sa"},{"$f":"VLOOKUP(A24,Juni!A:Y,21,FALSE)","v":0},{"$f":"VLOOKUP(A24,Juni!A:Z,17,FALSE)","v":0},{"$f":"VLOOKUP(A24,Juni!A:Z,18,FALSE)","v":0},{"$f":"VLOOKUP(A24,Juni!A:AA,20,FALSE)","v":0},{"$f":"VLOOKUP(A24,Juni!A:AB,26,FALSE)","v":""},{"$f":"VLOOKUP(A24,Juni!A:AC,25,FALSE)","v":0}]
["18.6.",{"$f":"VLOOKUP(A25,Juni!A:Z,2,FALSE)","v":"So"},{"$f":"VLOOKUP(A25,Juni!A:Y,21,FALSE)","v":0},{"$f":"VLOOKUP(A25,Juni!A:Z,17,FALSE)","v":0},{"$f":"VLOOKUP(A25,Juni!A:Z,18,FALSE)","v":0},{"$f":"VLOOKUP(A25,Juni!A:AA,20,FALSE)","v":0},{"$f":"VLOOKUP(A25,Juni!A:AB,26,FALSE)","v":""},{"$f":"VLOOKUP(A25,Juni!A:AC,25,FALSE)","v":0}]
["19.6.",{"$f":"VLOOKUP(A26,Juni!A:Z,2,FALSE)","v":"Mo"},{"$f":"VLOOKUP(A26,Juni!A:Y,21,FALSE)","v":0},{"$f":"VLOOKUP(A26,Juni!A:Z,17,FALSE)","v":0},{"$f":"VLOOKUP(A26,Juni!A:Z,18,FALSE)","v":0},{"$f":"VLOOKUP(A26,Juni!A:AA,20,FALSE)","v":0},{"$f":"VLOOKUP(A26,Juni!A:AB,26,FALSE)","v":""},{"$f":"VLOOKUP(A26,Juni!A:AC,25,FALSE)","v":0}]
["20.6.",{"$f":"VLOOKUP(A27,Juni!A:Z,2,FALSE)","v":"Die"},{"$f":"VLOOKUP(A27,Juni!A:Y,21,FALSE)","v":0},{"$f":"VLOOKUP(A27,Juni!A:Z,17,FALSE)","v":0},{"$f":"VLOOKUP(A27,Juni!A:Z,18,FALSE)","v":0},{"$f":"VLOOKUP(A27,Juni!A:AA,20,FALSE)","v":0},{"$f":"VLOOKUP(A27,Juni!A:AB,26,FALSE)","v":""},{"$f":"VLOOKUP(A27,Juni!A:AC,25,FALSE)","v":0}]
["21.6.",{"$f":"VLOOKUP(A28,Juni!A:Z,2,FALSE)","v":"Mi"},{"$f":"VLOOKUP(A28,Juni!A:Y,21,FALSE)","v":0},{"$f":"VLOOKUP(A28,Juni!A:Z,17,FALSE)","v":0},{"$f":"VLOOKUP(A28,Juni!A:Z,18,FALSE)","v":0},{"$f":"VLOOKUP(A28,Juni!A:AA,20,FALSE)","v":0},{"$f":"VLOOKUP(A28,Juni!A:AB,26,FALSE)","v":""},{"$f":"VLOOKUP(A28,Juni!A:AC,25,FALSE)","v":0}]
["22.6.",{"$f":"VLOOKUP(A29,Juni!A:Z,2,FALSE)","v":"Do"},{"$f":"VLOOKUP(A29,Juni!A:Y,21,FALSE)","v":0},{"$f":"VLOOKUP(A29,Juni!A:Z,17,FALSE)","v":0},{"$f":"VLOOKUP(A29,Juni!A:Z,18,FALSE)","v":0},{"$f":"VLOOKUP(A29,Juni!A:AA,20,FALSE)","v":0},{"$f":"VLOOKUP(A29,Juni!A:AB,26,FALSE)","v":""},{"$f":"VLOOKUP(A29,Juni!A:AC,25,FALSE)","v":0}]
["23.6.",{"$f":"VLOOKUP(A30,Juni!A:Z,2,FALSE)","v":"Fr"},{"$f":"VLOOKUP(A30,Juni!A:Y,21,FALSE)","v":0},{"$f":"VLOOKUP(A30,Juni!A:Z,17,FALSE)","v":0},{"$f":"VLOOKUP(A30,Juni!A:Z,18,FALSE)","v":0},{"$f":"VLOOKUP(A30,Juni!A:AA,20,FALSE)","v":0},{"$f":"VLOOKUP(A30,Juni!A:AB,26,FALSE)","v":""},{"$f":"VLOOKUP(A30,Juni!A:AC,25,FALSE)","v":0}]
["24.6.",{"$f":"VLOOKUP(A31,Juni!A:Z,2,FALSE)","v":"Sa"},{"$f":"VLOOKUP(A31,Juni!A:Y,21,FALSE)","v":0},{"$f":"VLOOKUP(A31,Juni!A:Z,17,FALSE)","v":0},{"$f":"VLOOKUP(A31,Juni!A:Z,18,FALSE)","v":0},{"$f":"VLOOKUP(A31,Juni!A:AA,20,FALSE)","v":0},{"$f":"VLOOKUP(A31,Juni!A:AB,26,FALSE)","v":""},{"$f":"VLOOKUP(A31,Juni!A:AC,25,FALSE)","v":0}]
["25.6.",{"$f":"VLOOKUP(A32,Juni!A:Z,2,FALSE)","v":"So"},{"$f":"VLOOKUP(A32,Juni!A:Y,21,FALSE)","v":0},{"$f":"VLOOKUP(A32,Juni!A:Z,17,FALSE)","v":0},{"$f":"VLOOKUP(A32,Juni!A:Z,18,FALSE)","v":0},{"$f":"VLOOKUP(A32,Juni!A:AA,20,FALSE)","v":0},{"$f":"VLOOKUP(A32,Juni!A:AB,26,FALSE)","v":""},{"$f":"VLOOKUP(A32,Juni!A:AC,25,FALSE)","v":0}]
["26.6.",{"$f":"VLOOKUP(A33,Juni!A:Z,2,FALSE)","v":"Mo"},{"$f":"VLOOKUP(A33,Juni!A:Y,21,FALSE)","v":0},{"$f":"VLOOKUP(A33,Juni!A:Z,17,FALSE)","v":0},{"$f":"VLOOKUP(A33,Juni!A:Z,18,FALSE)","v":0},{"$f":"VLOOKUP(A33,Juni!A:AA,20,FALSE)","v":0},{"$f":"VLOOKUP(A33,Juni!A:AB,26,FALSE)","v":""},{"$f":"VLOOKUP(A33,Juni!A:AC,25,FALSE)","v":0}]
["27.6.",{"$f":"VLOOKUP(A34,Juni!A:Z,2,FALSE)","v":"Die"},{"$f":"VLOOKUP(A34,Juni!A:Y,21,FALSE)","v":0},{"$f":"VLOOKUP(A34,Juni!A:Z,17,FALSE)","v":0},{"$f":"VLOOKUP(A34,Juni!A:Z,18,FALSE)","v":0},{"$f":"VLOOKUP(A34,Juni!A:AA,20,FALSE)","v":0},{"$f":"VLOOKUP(A34,Juni!A:AB,26,FALSE)","v":""},{"$f":"VLOOKUP(A34,Juni!A:AC,25,FALSE)","v":0}]
["28.6.",{"$f":"VLOOKUP(A35,Juni!A:Z,2,FALSE)","v":"Mi"},{"$f":"VLOOKUP(A35,Juni!A:Y,21,FALSE)","v":0},{"$f":"VLOOKUP(A35,Juni!A:Z,17,FALSE)","v":0},{"$f":"VLOOKUP(A35,Juni!A:Z,18,FALSE)","v":0},{"$f":"VLOOKUP(A35,Juni!A:AA,20,FALSE)","v":0},{"$f":"VLOOKUP(A35,Juni!A:AB,26,FALSE)","v":""},{"$f":"VLOOKUP(A35,Juni!A:AC,25,FALSE)","v":0}]
["29.6.",{"$f":"VLOOKUP(A36,Juni!A:Z,2,FALSE)","v":"Do"},{"$f":"VLOOKUP(A36,Juni!A:Y,21,FALSE)","v":0},{"$f":"VLOOKUP(A36,Juni!A:Z,17,FALSE)","v":0},{"$f":"VLOOKUP(A36,Juni!A:Z,18,FALSE)","v":0},{"$f":"VLOOKUP(A36,Juni!A:AA,20,FALSE)","v":0},{"$f":"VLOOKUP(A36,Juni!A:AB,26,FALSE)","v":""},{"$f":"VLOOKUP(A36,Juni!A:AC,25,FALSE)","v":0}]
["30.6.",{"$f":"VLOOKUP(A37,Juni!A:Z,2,FALSE)","v":"Fr"},{"$f":"VLOOKUP(A37,Juni!A:Y,21,FALSE)","v":0},{"$f":"VLOOKUP(A37,Juni!A:Z,17,FALSE)","v":0},{"$f":"VLOOKUP(A37,Juni!A:Z,18,FALSE)","v":0},{"$f":"VLOOKUP(A37,Juni!A:AA,20,FALSE)","v":0},{"$f":"VLOOKUP(A37,Juni!A:AB,26,FALSE)","v":""},{"$f":"VLOOKUP(A37,Juni!A:AC,25,FALSE)","v":0}]
[]
["1) Die Anzeige von \"Fehler\" in Spalte G erscheint, wenn im Arbeitsblatt des entsprechenden Monats: 1. Arbeitszeit und Urlaub erfasst wurde;  2. Urlaub und Krankheit jeweils eingegeben wurde und wenn 3. in der Erfassungstabelle (Monat) an Krankheitstagen Arbeitszeit eingetragen wurde.    Hintergrund: Im Urlaub oder bei Krankheit kann nicht gearbeitet werden."]
["2) An Krankheitstagen erscheint in dieser Tabelle dennoch eine Zahl bei der Arbeitszeit. Krankheit wird in AZ umgerechnet und erhöht die IST-AZ.; Bei der \"Fehler\"anzeige wurde Arbeitszeit in den Spalten C bis O (Monatsblatt) eingetragen."]
[]
["Zum Arbeitsblatt:",null,null,"JUNI"]

{"sheet":"Juli-Druck","index":23,"n_rows":43,"n_cols":8,"rows_kept":43,"cut":false,"hidden":false,"merged":[[42,0,42,2],[42,3,42,4],[0,0,0,1],[2,6,5,6],[5,0,5,1],[39,0,39,7],[40,0,40,7]]}
[{"$f":"Juli!V1","v":"JULI"},null,{"$f":"Stammdaten!C2","v":2023},null,null,null,null,{"$f":"Stammdaten!B3","v":0}]
["JAZ",null,{"$f":"Stammdaten!B26","v":1287}]
["Jahres-IST",null,{"$f":"Juli!U5","v":0}]
["Verbleibende AZ",null,{"$f":"Juli!W44","v":1287}]
["Urlaub im Monat",null,{"$f":"Juli!Q45","v":0}]
["Resturlaub zum Ende des Monats",null,{"$f":"Juli!Q5","v":30}]
["Datum","Tag","AZ","Urlaub","Krank/\nFreistellung","Ort","Plausibilität","Anmerkungen"]
["1.7.",{"$f":"VLOOKUP(A8,Juli!A:Z,2,FALSE)","v":"Sa"},{"$f":"VLOOKUP(A8,Juli!A:Y,21,FALSE)","v":0},{"$f":"VLOOKUP(A8,Juli!A:Z,17,FALSE)","v":0},{"$f":"VLOOKUP(A8,Juli!A:Z,18,FALSE)","v":0},{"$f":"VLOOKUP(A8,Juli!A:AA,20,FALSE)","v":0},{"$f":"VLOOKUP(A8,Juli!A:AB,26,FALSE)","v":""},{"$f":"VLOOKUP(A8,Juli!A:AC,25,FALSE)","v":0}]
["2.7.",{"$f":"VLOOKUP(A9,Juli!A:Z,2,FALSE)","v":"So"},{"$f":"VLOOKUP(A9,Juli!A:Y,21,FALSE)","v":0},{"$f":"VLOOKUP(A9,Juli!A:Z,17,FALSE)","v":0},{"$f":"VLOOKUP(A9,Juli!A:Z,18,FALSE)","v":0},{"$f":"VLOOKUP(A9,Juli!A:AA,20,FALSE)","v":0},{"$f":"VLOOKUP(A9,Juli!A:AB,26,FALSE)","v":""},{"$f":"VLOOKUP(A9,Juli!A:AC,25,FALSE)","v":0}]
["3.7.",{"$f":"VLOOKUP(A10,Juli!A:Z,2,FALSE)","v":"Mo"},{"$f":"VLOOKUP(A10,Juli!A:Y,21,FALSE)","v":0},{"$f":"VLOOKUP(A10,Juli!A:Z,17,FALSE)","v":0},{"$f":"VLOOKUP(A10,Juli!A:Z,18,FALSE)","v":0},{"$f":"VLOOKUP(A10,Juli!A:AA,20,FALSE)","v":0},{"$f":"VLOOKUP(A10,Juli!A:AB,26,FALSE)","v":""},{"$f":"VLOOKUP(A10,Juli!A:AC,25,FALSE)","v":0}]
["4.7.",{"$f":"VLOOKUP(A11,Juli!A:Z,2,FALSE)","v":"Die"},{"$f":"VLOOKUP(A11,Juli!A:Y,21,FALSE)","v":0},{"$f":"VLOOKUP(A11,Juli!A:Z,17,FALSE)","v":0},{"$f":"VLOOKUP(A11,Juli!A:Z,18,FALSE)","v":0},{"$f":"VLOOKUP(A11,Juli!A:AA,20,FALSE)","v":0},{"$f":"VLOOKUP(A11,Juli!A:AB,26,FALSE)","v":""},{"$f":"VLOOKUP(A11,Juli!A:AC,25,FALSE)","v":0}]
["5.7.",{"$f":"VLOOKUP(A12,Juli!A:Z,2,FALSE)","v":"Mi"},{"$f":"VLOOKUP(A12,Juli!A:Y,21,FALSE)","v":0},{"$f":"VLOOKUP(A12,Juli!A:Z,17,FALSE)","v":0},{"$f":"VLOOKUP(A12,Juli!A:Z,18,FALSE)","v":0},{"$f":"VLOOKUP(A12,Juli!A:AA,20,FALSE)","v":0},{"$f":"VLOOKUP(A12,Juli!A:AB,26,FALSE)","v":""},{"$f":"VLOOKUP(A12,Juli!A:AC,25,FALSE)","v":0}]
["6.7.",{"$f":"VLOOKUP(A13,Juli!A:Z,2,FALSE)","v":"Do"},{"$f":"VLOOKUP(A13,Juli!A:Y,21,FALSE)","v":0},{"$f":"VLOOKUP(A13,Juli!A:Z,17,FALSE)","v":0},{"$f":"VLOOKUP(A13,Juli!A:Z,18,FALSE)","v":0},{"$f":"VLOOKUP(A13,Juli!A:AA,20,FALSE)","v":0},{"$f":"VLOOKUP(A13,Juli!A:AB,26,FALSE)","v":""},{"$f":"VLOOKUP(A13,Juli!A:AC,25,FALSE)","v":0}]
["7.7.",{"$f":"VLOOKUP(A14,Juli!A:Z,2,FALSE)","v":"Fr"},{"$f":"VLOOKUP(A14,Juli!A:Y,21,FALSE)","v":0},{"$f":"VLOOKUP(A14,Juli!A:Z,17,FALSE)","v":0},{"$f":"VLOOKUP(A14,Juli!A:Z,18,FALSE)","v":0},{"$f":"VLOOKUP(A14,Juli!A:AA,20,FALSE)","v":0},{"$f":"VLOOKUP(A14,Juli!A:AB,26,FALSE)","v":""},{"$f":"VLOOKUP(A14,Juli!A:AC,25,FALSE)","v":0}]
["8.7.",{"$f":"VLOOKUP(A15,Juli!A:Z,2,FALSE)","v":"Sa"},{"$f":"VLOOKUP(A15,Juli!A:Y,21,FALSE)","v":0},{"$f":"VLOOKUP(A15,Juli!A:Z,17,FALSE)","v":0},{"$f":"VLOOKUP(A15,Juli!A:Z,18,FALSE)","v":0},{"$f":"VLOOKUP(A15,Juli!A:AA,20,FALSE)","v":0},{"$f":"VLOOKUP(A15,Juli!A:AB,26,FALSE)","v":""},{"$f":"VLOOKUP(A15,Juli!A:AC,25,FALSE)","v":0}]
["9.7.",{"$f":"VLOOKUP(A16,Juli!A:Z,2,FALSE)","v":"So"},{"$f":"VLOOKUP(A16,Juli!A:Y,21,FALSE)","v":0},{"$f":"VLOOKUP(A16,Juli!A:Z,17,FALSE)","v":0},{"$f":"VLOOKUP(A16,Juli!A:Z,18,FALSE)","v":0},{"$f":"VLOOKUP(A16,Juli!A:AA,20,FALSE)","v":0},{"$f":"VLOOKUP(A16,Juli!A:AB,26,FALSE)","v":""},{"$f":"VLOOKUP(A16,Juli!A:AC,25,FALSE)","v":0}]
["10.7.",{"$f":"VLOOKUP(A17,Juli!A:Z,2,FALSE)","v":"Mo"},{"$f":"VLOOKUP(A17,Juli!A:Y,21,FALSE)","v":0},{"$f":"VLOOKUP(A17,Juli!A:Z,17,FALSE)","v":0},{"$f":"VLOOKUP(A17,Juli!A:Z,18,FALSE)","v":0},{"$f":"VLOOKUP(A17,Juli!A:AA,20,FALSE)","v":0},{"$f":"VLOOKUP(A17,Juli!A:AB,26,FALSE)","v":""},{"$f":"VLOOKUP(A17,Juli!A:AC,25,FALSE)","v":0}]
["11.7.",{"$f":"VLOOKUP(A18,Juli!A:Z,2,FALSE)","v":"Die"},{"$f":"VLOOKUP(A18,Juli!A:Y,21,FALSE)","v":0},{"$f":"VLOOKUP(A18,Juli!A:Z,17,FALSE)","v":0},{"$f":"VLOOKUP(A18,Juli!A:Z,18,FALSE)","v":0},{"$f":"VLOOKUP(A18,Juli!A:AA,20,FALSE)","v":0},{"$f":"VLOOKUP(A18,Juli!A:AB,26,FALSE)","v":""},{"$f":"VLOOKUP(A18,Juli!A:AC,25,FALSE)","v":0}]
["12.7.",{"$f":"VLOOKUP(A19,Juli!A:Z,2,FALSE)","v":"Mi"},{"$f":"VLOOKUP(A19,Juli!A:Y,21,FALSE)","v":0},{"$f":"VLOOKUP(A19,Juli!A:Z,17,FALSE)","v":0},{"$f":"VLOOKUP(A19,Juli!A:Z,18,FALSE)","v":0},{"$f":"VLOOKUP(A19,Juli!A:AA,20,FALSE)","v":0},{"$f":"VLOOKUP(A19,Juli!A:AB,26,FALSE)","v":""},{"$f":"VLOOKUP(A19,Juli!A:AC,25,FALSE)","v":0}]
["13.7.",{"$f":"VLOOKUP(A20,Juli!A:Z,2,FALSE)","v":"Do"},{"$f":"VLOOKUP(A20,Juli!A:Y,21,FALSE)","v":0},{"$f":"VLOOKUP(A20,Juli!A:Z,17,FALSE)","v":0},{"$f":"VLOOKUP(A20,Juli!A:Z,18,FALSE)","v":0},{"$f":"VLOOKUP(A20,Juli!A:AA,20,FALSE)","v":0},{"$f":"VLOOKUP(A20,Juli!A:AB,26,FALSE)","v":""},{"$f":"VLOOKUP(A20,Juli!A:AC,25,FALSE)","v":0}]
["14.7.",{"$f":"VLOOKUP(A21,Juli!A:Z,2,FALSE)","v":"Fr"},{"$f":"VLOOKUP(A21,Juli!A:Y,21,FALSE)","v":0},{"$f":"VLOOKUP(A21,Juli!A:Z,17,FALSE)","v":0},{"$f":"VLOOKUP(A21,Juli!A:Z,18,FALSE)","v":0},{"$f":"VLOOKUP(A21,Juli!A:AA,20,FALSE)","v":0},{"$f":"VLOOKUP(A21,Juli!A:AB,26,FALSE)","v":""},{"$f":"VLOOKUP(A21,Juli!A:AC,25,FALSE)","v":0}]
["15.7.",{"$f":"VLOOKUP(A22,Juli!A:Z,2,FALSE)","v":"Sa"},{"$f":"VLOOKUP(A22,Juli!A:Y,21,FALSE)","v":0},{"$f":"VLOOKUP(A22,Juli!A:Z,17,FALSE)","v":0},{"$f":"VLOOKUP(A22,Juli!A:Z,18,FALSE)","v":0},{"$f":"VLOOKUP(A22,Juli!A:AA,20,FALSE)","v":0},{"$f":"VLOOKUP(A22,Juli!A:AB,26,FALSE)","v":""},{"$f":"VLOOKUP(A22,Juli!A:AC,25,FALSE)","v":0}]
["16.7.",{"$f":"VLOOKUP(A23,Juli!A:Z,2,FALSE)","v":"So"},{"$f":"VLOOKUP(A23,Juli!A:Y,21,FALSE)","v":0},{"$f":"VLOOKUP(A23,Juli!A:Z,17,FALSE)","v":0},{"$f":"VLOOKUP(A23,Juli!A:Z,18,FALSE)","v":0},{"$f":"VLOOKUP(A23,Juli!A:AA,20,FALSE)","v":0},{"$f":"VLOOKUP(A23,Juli!A:AB,26,FALSE)","v":""},{"$f":"VLOOKUP(A23,Juli!A:AC,25,FALSE)","v":0}]
["17.7.",{"$f":"VLOOKUP(A24,Juli!A:Z,2,FALSE)","v":"Mo"},{"$f":"VLOOKUP(A24,Juli!A:Y,21,FALSE)","v":0},{"$f":"VLOOKUP(A24,Juli!A:Z,17,FALSE)","v":0},{"$f":"VLOOKUP(A24,Juli!A:Z,18,FALSE)","v":0},{"$f":"VLOOKUP(A24,Juli!A:AA,20,FALSE)","v":0},{"$f":"VLOOKUP(A24,Juli!A:AB,26,FALSE)","v":""},{"$f":"VLOOKUP(A24,Juli!A:AC,25,FALSE)","v":0}]
["18.7.",{"$f":"VLOOKUP(A25,Juli!A:Z,2,FALSE)","v":"Die"},{"$f":"VLOOKUP(A25,Juli!A:Y,21,FALSE)","v":0},{"$f":"VLOOKUP(A25,Juli!A:Z,17,FALSE)","v":0},{"$f":"VLOOKUP(A25,Juli!A:Z,18,FALSE)","v":0},{"$f":"VLOOKUP(A25,Juli!A:AA,20,FALSE)","v":0},{"$f":"VLOOKUP(A25,Juli!A:AB,26,FALSE)","v":""},{"$f":"VLOOKUP(A25,Juli!A:AC,25,FALSE)","v":0}]
["19.7.",{"$f":"VLOOKUP(A26,Juli!A:Z,2,FALSE)","v":"Mi"},{"$f":"VLOOKUP(A26,Juli!A:Y,21,FALSE)","v":0},{"$f":"VLOOKUP(A26,Juli!A:Z,17,FALSE)","v":0},{"$f":"VLOOKUP(A26,Juli!A:Z,18,FALSE)","v":0},{"$f":"VLOOKUP(A26,Juli!A:AA,20,FALSE)","v":0},{"$f":"VLOOKUP(A26,Juli!A:AB,26,FALSE)","v":""},{"$f":"VLOOKUP(A26,Juli!A:AC,25,FALSE)","v":0}]
["20.7.",{"$f":"VLOOKUP(A27,Juli!A:Z,2,FALSE)","v":"Do"},{"$f":"VLOOKUP(A27,Juli!A:Y,21,FALSE)","v":0},{"$f":"VLOOKUP(A27,Juli!A:Z,17,FALSE)","v":0},{"$f":"VLOOKUP(A27,Juli!A:Z,18,FALSE)","v":0},{"$f":"VLOOKUP(A27,Juli!A:AA,20,FALSE)","v":0},{"$f":"VLOOKUP(A27,Juli!A:AB,26,FALSE)","v":""},{"$f":"VLOOKUP(A27,Juli!A:AC,25,FALSE)","v":0}]
["21.7.",{"$f":"VLOOKUP(A28,Juli!A:Z,2,FALSE)","v":"Fr"},{"$f":"VLOOKUP(A28,Juli!A:Y,21,FALSE)","v":0},{"$f":"VLOOKUP(A28,Juli!A:Z,17,FALSE)","v":0},{"$f":"VLOOKUP(A28,Juli!A:Z,18,FALSE)","v":0},{"$f":"VLOOKUP(A28,Juli!A:AA,20,FALSE)","v":0},{"$f":"VLOOKUP(A28,Juli!A:AB,26,FALSE)","v":""},{"$f":"VLOOKUP(A28,Juli!A:AC,25,FALSE)","v":0}]
["22.7.",{"$f":"VLOOKUP(A29,Juli!A:Z,2,FALSE)","v":"Sa"},{"$f":"VLOOKUP(A29,Juli!A:Y,21,FALSE)","v":0},{"$f":"VLOOKUP(A29,Juli!A:Z,17,FALSE)","v":0},{"$f":"VLOOKUP(A29,Juli!A:Z,18,FALSE)","v":0},{"$f":"VLOOKUP(A29,Juli!A:AA,20,FALSE)","v":0},{"$f":"VLOOKUP(A29,Juli!A:AB,26,FALSE)","v":""},{"$f":"VLOOKUP(A29,Juli!A:AC,25,FALSE)","v":0}]
["23.7.",{"$f":"VLOOKUP(A30,Juli!A:Z,2,FALSE)","v":"So"},{"$f":"VLOOKUP(A30,Juli!A:Y,21,FALSE)","v":0},{"$f":"VLOOKUP(A30,Juli!A:Z,17,FALSE)","v":0},{"$f":"VLOOKUP(A30,Juli!A:Z,18,FALSE)","v":0},{"$f":"VLOOKUP(A30,Juli!A:AA,20,FALSE)","v":0},{"$f":"VLOOKUP(A30,Juli!A:AB,26,FALSE)","v":""},{"$f":"VLOOKUP(A30,Juli!A:AC,25,FALSE)","v":0}]
["24.7.",{"$f":"VLOOKUP(A31,Juli!A:Z,2,FALSE)","v":"Mo"},{"$f":"VLOOKUP(A31,Juli!A:Y,21,FALSE)","v":0},{"$f":"VLOOKUP(A31,Juli!A:Z,17,FALSE)","v":0},{"$f":"VLOOKUP(A31,Juli!A:Z,18,FALSE)","v":0},{"$f":"VLOOKUP(A31,Juli!A:AA,20,FALSE)","v":0},{"$f":"VLOOKUP(A31,Juli!A:AB,26,FALSE)","v":""},{"$f":"VLOOKUP(A31,Juli!A:AC,25,FALSE)","v":0}]
["25.7.",{"$f":"VLOOKUP(A32,Juli!A:Z,2,FALSE)","v":"Die"},{"$f":"VLOOKUP(A32,Juli!A:Y,21,FALSE)","v":0},{"$f":"VLOOKUP(A32,Juli!A:Z,17,FALSE)","v":0},{"$f":"VLOOKUP(A32,Juli!A:Z,18,FALSE)","v":0},{"$f":"VLOOKUP(A32,Juli!A:AA,20,FALSE)","v":0},{"$f":"VLOOKUP(A32,Juli!A:AB,26,FALSE)","v":""},{"$f":"VLOOKUP(A32,Juli!A:AC,25,FALSE)","v":0}]
["26.7.",{"$f":"VLOOKUP(A33,Juli!A:Z,2,FALSE)","v":"Mi"},{"$f":"VLOOKUP(A33,Juli!A:Y,21,FALSE)","v":0},{"$f":"VLOOKUP(A33,Juli!A:Z,17,FALSE)","v":0},{"$f":"VLOOKUP(A33,Juli!A:Z,18,FALSE)","v":0},{"$f":"VLOOKUP(A33,Juli!A:AA,20,FALSE)","v":0},{"$f":"VLOOKUP(A33,Juli!A:AB,26,FALSE)","v":""},{"$f":"VLOOKUP(A33,Juli!A:AC,25,FALSE)","v":0}]
["27.7.",{"$f":"VLOOKUP(A34,Juli!A:Z,2,FALSE)","v":"Do"},{"$f":"VLOOKUP(A34,Juli!A:Y,21,FALSE)","v":0},{"$f":"VLOOKUP(A34,Juli!A:Z,17,FALSE)","v":0},{"$f":"VLOOKUP(A34,Juli!A:Z,18,FALSE)","v":0},{"$f":"VLOOKUP(A34,Juli!A:AA,20,FALSE)","v":0},{"$f":"VLOOKUP(A34,Juli!A:AB,26,FALSE)","v":""},{"$f":"VLOOKUP(A34,Juli!A:AC,25,FALSE)","v":0}]
["28.7.",{"$f":"VLOOKUP(A35,Juli!A:Z,2,FALSE)","v":"Fr"},{"$f":"VLOOKUP(A35,Juli!A:Y,21,FALSE)","v":0},{"$f":"VLOOKUP(A35,Juli!A:Z,17,FALSE)","v":0},{"$f":"VLOOKUP(A35,Juli!A:Z,18,FALSE)","v":0},{"$f":"VLOOKUP(A35,Juli!A:AA,20,FALSE)","v":0},{"$f":"VLOOKUP(A35,Juli!A:AB,26,FALSE)","v":""},{"$f":"VLOOKUP(A35,Juli!A:AC,25,FALSE)","v":0}]
["29.7.",{"$f":"VLOOKUP(A36,Juli!A:Z,2,FALSE)","v":"Sa"},{"$f":"VLOOKUP(A36,Juli!A:Y,21,FALSE)","v":0},{"$f":"VLOOKUP(A36,Juli!A:Z,17,FALSE)","v":0},{"$f":"VLOOKUP(A36,Juli!A:Z,18,FALSE)","v":0},{"$f":"VLOOKUP(A36,Juli!A:AA,20,FALSE)","v":0},{"$f":"VLOOKUP(A36,Juli!A:AB,26,FALSE)","v":""},{"$f":"VLOOKUP(A36,Juli!A:AC,25,FALSE)","v":0}]
["30.7.",{"$f":"VLOOKUP(A37,Juli!A:Z,2,FALSE)","v":"So"},{"$f":"VLOOKUP(A37,Juli!A:Y,21,FALSE)","v":0},{"$f":"VLOOKUP(A37,Juli!A:Z,17,FALSE)","v":0},{"$f":"VLOOKUP(A37,Juli!A:Z,18,FALSE)","v":0},{"$f":"VLOOKUP(A37,Juli!A:AA,20,FALSE)","v":0},{"$f":"VLOOKUP(A37,Juli!A:AB,26,FALSE)","v":""},{"$f":"VLOOKUP(A37,Juli!A:AC,25,FALSE)","v":0}]
["31.7.",{"$f":"VLOOKUP(A38,Juli!A:Z,2,FALSE)","v":"Mo"},{"$f":"VLOOKUP(A38,Juli!A:Y,21,FALSE)","v":0},{"$f":"VLOOKUP(A38,Juli!A:Z,17,FALSE)","v":0},{"$f":"VLOOKUP(A38,Juli!A:Z,18,FALSE)","v":0},{"$f":"VLOOKUP(A38,Juli!A:AA,20,FALSE)","v":0},{"$f":"VLOOKUP(A38,Juli!A:AB,26,FALSE)","v":""},{"$f":"VLOOKUP(A38,Juli!A:AC,25,FALSE)","v":0}]
[]
["1) Die Anzeige von \"Fehler\" in Spalte G erscheint, wenn im Arbeitsblatt des entsprechenden Monats: 1. Arbeitszeit und Urlaub erfasst wurde;  2. Urlaub und Krankheit jeweils eingegeben wurde und wenn 3. in der Erfassungstabelle (Monat) an Krankheitstagen Arbeitszeit eingetragen wurde.    Hintergrund: Im Urlaub oder bei Krankheit kann nicht gearbeitet werden."]
["2) An Krankheitstagen erscheint in dieser Tabelle dennoch eine Zahl bei der Arbeitszeit. Krankheit wird in AZ umgerechnet und erhöht die IST-AZ.; Bei der \"Fehler\"anzeige wurde Arbeitszeit in den Spalten C bis O (Monatsblatt) eingetragen."]
[]
["Zum Arbeitsblatt:",null,null,"JULI"]

{"sheet":"August-Druck","index":24,"n_rows":43,"n_cols":8,"rows_kept":43,"cut":false,"hidden":false,"merged":[[42,0,42,2],[42,3,42,4],[0,0,0,1],[2,6,5,6],[5,0,5,1],[39,0,39,7],[40,0,40,7]]}
[{"$f":"August!V1","v":"AUGUST"},null,{"$f":"Stammdaten!C2","v":2023},null,null,null,null,{"$f":"Stammdaten!B3","v":0}]
["JAZ",null,{"$f":"Stammdaten!B26","v":1287}]
["Jahres-IST",null,{"$f":"August!U5","v":0}]
["Verbleibende AZ",null,{"$f":"August!W44","v":1287}]
["Urlaub im Monat",null,{"$f":"August!Q45","v":0}]
["Resturlaub zum Ende des Monats",null,{"$f":"August!Q5","v":30}]
["Datum","Tag","AZ","Urlaub","Krank/\nFreistellung","Ort","Plausibilität","Anmerkungen"]
["1.8.",{"$f":"VLOOKUP(A8,August!A:Z,2,FALSE)","v":"Die"},{"$f":"VLOOKUP(A8,August!A:Y,21,FALSE)","v":0},{"$f":"VLOOKUP(A8,August!A:Z,17,FALSE)","v":0},{"$f":"VLOOKUP(A8,August!A:Z,18,FALSE)","v":0},{"$f":"VLOOKUP(A8,August!A:AA,20,FALSE)","v":0},{"$f":"VLOOKUP(A8,August!A:AB,26,FALSE)","v":""},{"$f":"VLOOKUP(A8,August!A:AC,25,FALSE)","v":0}]
["2.8.",{"$f":"VLOOKUP(A9,August!A:Z,2,FALSE)","v":"Mi"},{"$f":"VLOOKUP(A9,August!A:Y,21,FALSE)","v":0},{"$f":"VLOOKUP(A9,August!A:Z,17,FALSE)","v":0},{"$f":"VLOOKUP(A9,August!A:Z,18,FALSE)","v":0},{"$f":"VLOOKUP(A9,August!A:AA,20,FALSE)","v":0},{"$f":"VLOOKUP(A9,August!A:AB,26,FALSE)","v":""},{"$f":"VLOOKUP(A9,August!A:AC,25,FALSE)","v":0}]
["3.8.",{"$f":"VLOOKUP(A10,August!A:Z,2,FALSE)","v":"Do"},{"$f":"VLOOKUP(A10,August!A:Y,21,FALSE)","v":0},{"$f":"VLOOKUP(A10,August!A:Z,17,FALSE)","v":0},{"$f":"VLOOKUP(A10,August!A:Z,18,FALSE)","v":0},{"$f":"VLOOKUP(A10,August!A:AA,20,FALSE)","v":0},{"$f":"VLOOKUP(A10,August!A:AB,26,FALSE)","v":""},{"$f":"VLOOKUP(A10,August!A:AC,25,FALSE)","v":0}]
["4.8.",{"$f":"VLOOKUP(A11,August!A:Z,2,FALSE)","v":"Fr"},{"$f":"VLOOKUP(A11,August!A:Y,21,FALSE)","v":0},{"$f":"VLOOKUP(A11,August!A:Z,17,FALSE)","v":0},{"$f":"VLOOKUP(A11,August!A:Z,18,FALSE)","v":0},{"$f":"VLOOKUP(A11,August!A:AA,20,FALSE)","v":0},{"$f":"VLOOKUP(A11,August!A:AB,26,FALSE)","v":""},{"$f":"VLOOKUP(A11,August!A:AC,25,FALSE)","v":0}]
["5.8.",{"$f":"VLOOKUP(A12,August!A:Z,2,FALSE)","v":"Sa"},{"$f":"VLOOKUP(A12,August!A:Y,21,FALSE)","v":0},{"$f":"VLOOKUP(A12,August!A:Z,17,FALSE)","v":0},{"$f":"VLOOKUP(A12,August!A:Z,18,FALSE)","v":0},{"$f":"VLOOKUP(A12,August!A:AA,20,FALSE)","v":0},{"$f":"VLOOKUP(A12,August!A:AB,26,FALSE)","v":""},{"$f":"VLOOKUP(A12,August!A:AC,25,FALSE)","v":0}]
["6.8.",{"$f":"VLOOKUP(A13,August!A:Z,2,FALSE)","v":"So"},{"$f":"VLOOKUP(A13,August!A:Y,21,FALSE)","v":0},{"$f":"VLOOKUP(A13,August!A:Z,17,FALSE)","v":0},{"$f":"VLOOKUP(A13,August!A:Z,18,FALSE)","v":0},{"$f":"VLOOKUP(A13,August!A:AA,20,FALSE)","v":0},{"$f":"VLOOKUP(A13,August!A:AB,26,FALSE)","v":""},{"$f":"VLOOKUP(A13,August!A:AC,25,FALSE)","v":0}]
["7.8.",{"$f":"VLOOKUP(A14,August!A:Z,2,FALSE)","v":"Mo"},{"$f":"VLOOKUP(A14,August!A:Y,21,FALSE)","v":0},{"$f":"VLOOKUP(A14,August!A:Z,17,FALSE)","v":0},{"$f":"VLOOKUP(A14,August!A:Z,18,FALSE)","v":0},{"$f":"VLOOKUP(A14,August!A:AA,20,FALSE)","v":0},{"$f":"VLOOKUP(A14,August!A:AB,26,FALSE)","v":""},{"$f":"VLOOKUP(A14,August!A:AC,25,FALSE)","v":0}]
["8.8.",{"$f":"VLOOKUP(A15,August!A:Z,2,FALSE)","v":"Die"},{"$f":"VLOOKUP(A15,August!A:Y,21,FALSE)","v":0},{"$f":"VLOOKUP(A15,August!A:Z,17,FALSE)","v":0},{"$f":"VLOOKUP(A15,August!A:Z,18,FALSE)","v":0},{"$f":"VLOOKUP(A15,August!A:AA,20,FALSE)","v":0},{"$f":"VLOOKUP(A15,August!A:AB,26,FALSE)","v":""},{"$f":"VLOOKUP(A15,August!A:AC,25,FALSE)","v":0}]
["9.8.",{"$f":"VLOOKUP(A16,August!A:Z,2,FALSE)","v":"Mi"},{"$f":"VLOOKUP(A16,August!A:Y,21,FALSE)","v":0},{"$f":"VLOOKUP(A16,August!A:Z,17,FALSE)","v":0},{"$f":"VLOOKUP(A16,August!A:Z,18,FALSE)","v":0},{"$f":"VLOOKUP(A16,August!A:AA,20,FALSE)","v":0},{"$f":"VLOOKUP(A16,August!A:AB,26,FALSE)","v":""},{"$f":"VLOOKUP(A16,August!A:AC,25,FALSE)","v":0}]
["10.8.",{"$f":"VLOOKUP(A17,August!A:Z,2,FALSE)","v":"Do"},{"$f":"VLOOKUP(A17,August!A:Y,21,FALSE)","v":0},{"$f":"VLOOKUP(A17,August!A:Z,17,FALSE)","v":0},{"$f":"VLOOKUP(A17,August!A:Z,18,FALSE)","v":0},{"$f":"VLOOKUP(A17,August!A:AA,20,FALSE)","v":0},{"$f":"VLOOKUP(A17,August!A:AB,26,FALSE)","v":""},{"$f":"VLOOKUP(A17,August!A:AC,25,FALSE)","v":0}]
["11.8.",{"$f":"VLOOKUP(A18,August!A:Z,2,FALSE)","v":"Fr"},{"$f":"VLOOKUP(A18,August!A:Y,21,FALSE)","v":0},{"$f":"VLOOKUP(A18,August!A:Z,17,FALSE)","v":0},{"$f":"VLOOKUP(A18,August!A:Z,18,FALSE)","v":0},{"$f":"VLOOKUP(A18,August!A:AA,20,FALSE)","v":0},{"$f":"VLOOKUP(A18,August!A:AB,26,FALSE)","v":""},{"$f":"VLOOKUP(A18,August!A:AC,25,FALSE)","v":0}]
["12.8.",{"$f":"VLOOKUP(A19,August!A:Z,2,FALSE)","v":"Sa"},{"$f":"VLOOKUP(A19,August!A:Y,21,FALSE)","v":0},{"$f":"VLOOKUP(A19,August!A:Z,17,FALSE)","v":0},{"$f":"VLOOKUP(A19,August!A:Z,18,FALSE)","v":0},{"$f":"VLOOKUP(A19,August!A:AA,20,FALSE)","v":0},{"$f":"VLOOKUP(A19,August!A:AB,26,FALSE)","v":""},{"$f":"VLOOKUP(A19,August!A:AC,25,FALSE)","v":0}]
["13.8.",{"$f":"VLOOKUP(A20,August!A:Z,2,FALSE)","v":"So"},{"$f":"VLOOKUP(A20,August!A:Y,21,FALSE)","v":0},{"$f":"VLOOKUP(A20,August!A:Z,17,FALSE)","v":0},{"$f":"VLOOKUP(A20,August!A:Z,18,FALSE)","v":0},{"$f":"VLOOKUP(A20,August!A:AA,20,FALSE)","v":0},{"$f":"VLOOKUP(A20,August!A:AB,26,FALSE)","v":""},{"$f":"VLOOKUP(A20,August!A:AC,25,FALSE)","v":0}]
["14.8.",{"$f":"VLOOKUP(A21,August!A:Z,2,FALSE)","v":"Mo"},{"$f":"VLOOKUP(A21,August!A:Y,21,FALSE)","v":0},{"$f":"VLOOKUP(A21,August!A:Z,17,FALSE)","v":0},{"$f":"VLOOKUP(A21,August!A:Z,18,FALSE)","v":0},{"$f":"VLOOKUP(A21,August!A:AA,20,FALSE)","v":0},{"$f":"VLOOKUP(A21,August!A:AB,26,FALSE)","v":""},{"$f":"VLOOKUP(A21,August!A:AC,25,FALSE)","v":0}]
["15.8.",{"$f":"VLOOKUP(A22,August!A:Z,2,FALSE)","v":"Die"},{"$f":"VLOOKUP(A22,August!A:Y,21,FALSE)","v":0},{"$f":"VLOOKUP(A22,August!A:Z,17,FALSE)","v":0},{"$f":"VLOOKUP(A22,August!A:Z,18,FALSE)","v":0},{"$f":"VLOOKUP(A22,August!A:AA,20,FALSE)","v":0},{"$f":"VLOOKUP(A22,August!A:AB,26,FALSE)","v":""},{"$f":"VLOOKUP(A22,August!A:AC,25,FALSE)","v":0}]
["16.8.",{"$f":"VLOOKUP(A23,August!A:Z,2,FALSE)","v":"Mi"},{"$f":"VLOOKUP(A23,August!A:Y,21,FALSE)","v":0},{"$f":"VLOOKUP(A23,August!A:Z,17,FALSE)","v":0},{"$f":"VLOOKUP(A23,August!A:Z,18,FALSE)","v":0},{"$f":"VLOOKUP(A23,August!A:AA,20,FALSE)","v":0},{"$f":"VLOOKUP(A23,August!A:AB,26,FALSE)","v":""},{"$f":"VLOOKUP(A23,August!A:AC,25,FALSE)","v":0}]
["17.8.",{"$f":"VLOOKUP(A24,August!A:Z,2,FALSE)","v":"Do"},{"$f":"VLOOKUP(A24,August!A:Y,21,FALSE)","v":0},{"$f":"VLOOKUP(A24,August!A:Z,17,FALSE)","v":0},{"$f":"VLOOKUP(A24,August!A:Z,18,FALSE)","v":0},{"$f":"VLOOKUP(A24,August!A:AA,20,FALSE)","v":0},{"$f":"VLOOKUP(A24,August!A:AB,26,FALSE)","v":""},{"$f":"VLOOKUP(A24,August!A:AC,25,FALSE)","v":0}]
["18.8.",{"$f":"VLOOKUP(A25,August!A:Z,2,FALSE)","v":"Fr"},{"$f":"VLOOKUP(A25,August!A:Y,21,FALSE)","v":0},{"$f":"VLOOKUP(A25,August!A:Z,17,FALSE)","v":0},{"$f":"VLOOKUP(A25,August!A:Z,18,FALSE)","v":0},{"$f":"VLOOKUP(A25,August!A:AA,20,FALSE)","v":0},{"$f":"VLOOKUP(A25,August!A:AB,26,FALSE)","v":""},{"$f":"VLOOKUP(A25,August!A:AC,25,FALSE)","v":0}]
["19.8.",{"$f":"VLOOKUP(A26,August!A:Z,2,FALSE)","v":"Sa"},{"$f":"VLOOKUP(A26,August!A:Y,21,FALSE)","v":0},{"$f":"VLOOKUP(A26,August!A:Z,17,FALSE)","v":0},{"$f":"VLOOKUP(A26,August!A:Z,18,FALSE)","v":0},{"$f":"VLOOKUP(A26,August!A:AA,20,FALSE)","v":0},{"$f":"VLOOKUP(A26,August!A:AB,26,FALSE)","v":""},{"$f":"VLOOKUP(A26,August!A:AC,25,FALSE)","v":0}]
["20.8.",{"$f":"VLOOKUP(A27,August!A:Z,2,FALSE)","v":"So"},{"$f":"VLOOKUP(A27,August!A:Y,21,FALSE)","v":0},{"$f":"VLOOKUP(A27,August!A:Z,17,FALSE)","v":0},{"$f":"VLOOKUP(A27,August!A:Z,18,FALSE)","v":0},{"$f":"VLOOKUP(A27,August!A:AA,20,FALSE)","v":0},{"$f":"VLOOKUP(A27,August!A:AB,26,FALSE)","v":""},{"$f":"VLOOKUP(A27,August!A:AC,25,FALSE)","v":0}]
["21.8.",{"$f":"VLOOKUP(A28,August!A:Z,2,FALSE)","v":"Mo"},{"$f":"VLOOKUP(A28,August!A:Y,21,FALSE)","v":0},{"$f":"VLOOKUP(A28,August!A:Z,17,FALSE)","v":0},{"$f":"VLOOKUP(A28,August!A:Z,18,FALSE)","v":0},{"$f":"VLOOKUP(A28,August!A:AA,20,FALSE)","v":0},{"$f":"VLOOKUP(A28,August!A:AB,26,FALSE)","v":""},{"$f":"VLOOKUP(A28,August!A:AC,25,FALSE)","v":0}]
["22.8.",{"$f":"VLOOKUP(A29,August!A:Z,2,FALSE)","v":"Die"},{"$f":"VLOOKUP(A29,August!A:Y,21,FALSE)","v":0},{"$f":"VLOOKUP(A29,August!A:Z,17,FALSE)","v":0},{"$f":"VLOOKUP(A29,August!A:Z,18,FALSE)","v":0},{"$f":"VLOOKUP(A29,August!A:AA,20,FALSE)","v":0},{"$f":"VLOOKUP(A29,August!A:AB,26,FALSE)","v":""},{"$f":"VLOOKUP(A29,August!A:AC,25,FALSE)","v":0}]
["23.8.",{"$f":"VLOOKUP(A30,August!A:Z,2,FALSE)","v":"Mi"},{"$f":"VLOOKUP(A30,August!A:Y,21,FALSE)","v":0},{"$f":"VLOOKUP(A30,August!A:Z,17,FALSE)","v":0},{"$f":"VLOOKUP(A30,August!A:Z,18,FALSE)","v":0},{"$f":"VLOOKUP(A30,August!A:AA,20,FALSE)","v":0},{"$f":"VLOOKUP(A30,August!A:AB,26,FALSE)","v":""},{"$f":"VLOOKUP(A30,August!A:AC,25,FALSE)","v":0}]
["24.8.",{"$f":"VLOOKUP(A31,August!A:Z,2,FALSE)","v":"Do"},{"$f":"VLOOKUP(A31,August!A:Y,21,FALSE)","v":0},{"$f":"VLOOKUP(A31,August!A:Z,17,FALSE)","v":0},{"$f":"VLOOKUP(A31,August!A:Z,18,FALSE)","v":0},{"$f":"VLOOKUP(A31,August!A:AA,20,FALSE)","v":0},{"$f":"VLOOKUP(A31,August!A:AB,26,FALSE)","v":""},{"$f":"VLOOKUP(A31,August!A:AC,25,FALSE)","v":0}]
["25.8.",{"$f":"VLOOKUP(A32,August!A:Z,2,FALSE)","v":"Fr"},{"$f":"VLOOKUP(A32,August!A:Y,21,FALSE)","v":0},{"$f":"VLOOKUP(A32,August!A:Z,17,FALSE)","v":0},{"$f":"VLOOKUP(A32,August!A:Z,18,FALSE)","v":0},{"$f":"VLOOKUP(A32,August!A:AA,20,FALSE)","v":0},{"$f":"VLOOKUP(A32,August!A:AB,26,FALSE)","v":""},{"$f":"VLOOKUP(A32,August!A:AC,25,FALSE)","v":0}]
["26.8.",{"$f":"VLOOKUP(A33,August!A:Z,2,FALSE)","v":"Sa"},{"$f":"VLOOKUP(A33,August!A:Y,21,FALSE)","v":0},{"$f":"VLOOKUP(A33,August!A:Z,17,FALSE)","v":0},{"$f":"VLOOKUP(A33,August!A:Z,18,FALSE)","v":0},{"$f":"VLOOKUP(A33,August!A:AA,20,FALSE)","v":0},{"$f":"VLOOKUP(A33,August!A:AB,26,FALSE)","v":""},{"$f":"VLOOKUP(A33,August!A:AC,25,FALSE)","v":0}]
["27.8.",{"$f":"VLOOKUP(A34,August!A:Z,2,FALSE)","v":"So"},{"$f":"VLOOKUP(A34,August!A:Y,21,FALSE)","v":0},{"$f":"VLOOKUP(A34,August!A:Z,17,FALSE)","v":0},{"$f":"VLOOKUP(A34,August!A:Z,18,FALSE)","v":0},{"$f":"VLOOKUP(A34,August!A:AA,20,FALSE)","v":0},{"$f":"VLOOKUP(A34,August!A:AB,26,FALSE)","v":""},{"$f":"VLOOKUP(A34,August!A:AC,25,FALSE)","v":0}]
["28.8.",{"$f":"VLOOKUP(A35,August!A:Z,2,FALSE)","v":"Mo"},{"$f":"VLOOKUP(A35,August!A:Y,21,FALSE)","v":0},{"$f":"VLOOKUP(A35,August!A:Z,17,FALSE)","v":0},{"$f":"VLOOKUP(A35,August!A:Z,18,FALSE)","v":0},{"$f":"VLOOKUP(A35,August!A:AA,20,FALSE)","v":0},{"$f":"VLOOKUP(A35,August!A:AB,26,FALSE)","v":""},{"$f":"VLOOKUP(A35,August!A:AC,25,FALSE)","v":0}]
["29.8.",{"$f":"VLOOKUP(A36,August!A:Z,2,FALSE)","v":"Die"},{"$f":"VLOOKUP(A36,August!A:Y,21,FALSE)","v":0},{"$f":"VLOOKUP(A36,August!A:Z,17,FALSE)","v":0},{"$f":"VLOOKUP(A36,August!A:Z,18,FALSE)","v":0},{"$f":"VLOOKUP(A36,August!A:AA,20,FALSE)","v":0},{"$f":"VLOOKUP(A36,August!A:AB,26,FALSE)","v":""},{"$f":"VLOOKUP(A36,August!A:AC,25,FALSE)","v":0}]
["30.8.",{"$f":"VLOOKUP(A37,August!A:Z,2,FALSE)","v":"Mi"},{"$f":"VLOOKUP(A37,August!A:Y,21,FALSE)","v":0},{"$f":"VLOOKUP(A37,August!A:Z,17,FALSE)","v":0},{"$f":"VLOOKUP(A37,August!A:Z,18,FALSE)","v":0},{"$f":"VLOOKUP(A37,August!A:AA,20,FALSE)","v":0},{"$f":"VLOOKUP(A37,August!A:AB,26,FALSE)","v":""},{"$f":"VLOOKUP(A37,August!A:AC,25,FALSE)","v":0}]
["31.8.",{"$f":"VLOOKUP(A38,August!A:Z,2,FALSE)","v":"Do"},{"$f":"VLOOKUP(A38,August!A:Y,21,FALSE)","v":0},{"$f":"VLOOKUP(A38,August!A:Z,17,FALSE)","v":0},{"$f":"VLOOKUP(A38,August!A:Z,18,FALSE)","v":0},{"$f":"VLOOKUP(A38,August!A:AA,20,FALSE)","v":0},{"$f":"VLOOKUP(A38,August!A:AB,26,FALSE)","v":""},{"$f":"VLOOKUP(A38,August!A:AC,25,FALSE)","v":0}]
[]
["1) Die Anzeige von \"Fehler\" in Spalte G erscheint, wenn im Arbeitsblatt des entsprechenden Monats: 1. Arbeitszeit und Urlaub erfasst wurde;  2. Urlaub und Krankheit jeweils eingegeben wurde und wenn 3. in der Erfassungstabelle (Monat) an Krankheitstagen Arbeitszeit eingetragen wurde.    Hintergrund: Im Urlaub oder bei Krankheit kann nicht gearbeitet werden."]
["2) An Krankheitstagen erscheint in dieser Tabelle dennoch eine Zahl bei der Arbeitszeit. Krankheit wird in AZ umgerechnet und erhöht die IST-AZ.; Bei der \"Fehler\"anzeige wurde Arbeitszeit in den Spalten C bis O (Monatsblatt) eingetragen."]
[]
["Zum Arbeitsblatt:",null,null,"AUGUST"]

{"sheet":"September-Druck","index":25,"n_rows":42,"n_cols":8,"rows_kept":42,"cut":false,"hidden":false,"merged":[[41,0,41,2],[41,3,41,4],[0,0,0,1],[2,6,5,6],[5,0,5,1],[38,0,38,7],[39,0,39,7]]}
[{"$f":"September!V1","v":"SEPTEMBER"},null,{"$f":"Stammdaten!C2","v":2023},null,null,null,null,{"$f":"Stammdaten!B3","v":0}]
["JAZ",null,{"$f":"Stammdaten!B26","v":1287}]
["Jahres-IST",null,{"$f":"September!U5","v":0}]
["Verbleibende AZ",null,{"$f":"September!W44","v":1287}]
["Urlaub im Monat",null,{"$f":"September!Q45","v":0}]
["Resturlaub zum Ende des Monats",null,{"$f":"September!Q5","v":30}]
["Datum","Tag","AZ","Urlaub","Krank/\nFreistellung","Ort","Plausibilität","Anmerkungen"]
["1.9.",{"$f":"VLOOKUP(A8,September!A:Z,2,FALSE)","v":"Fr"},{"$f":"VLOOKUP(A8,September!A:Y,21,FALSE)","v":0},{"$f":"VLOOKUP(A8,September!A:Z,17,FALSE)","v":0},{"$f":"VLOOKUP(A8,September!A:Z,18,FALSE)","v":0},{"$f":"VLOOKUP(A8,September!A:AA,20,FALSE)","v":0},{"$f":"VLOOKUP(A8,September!A:AB,26,FALSE)","v":""},{"$f":"VLOOKUP(A8,September!A:AC,25,FALSE)","v":0}]
["2.9.",{"$f":"VLOOKUP(A9,September!A:Z,2,FALSE)","v":"Sa"},{"$f":"VLOOKUP(A9,September!A:Y,21,FALSE)","v":0},{"$f":"VLOOKUP(A9,September!A:Z,17,FALSE)","v":0},{"$f":"VLOOKUP(A9,September!A:Z,18,FALSE)","v":0},{"$f":"VLOOKUP(A9,September!A:AA,20,FALSE)","v":0},{"$f":"VLOOKUP(A9,September!A:AB,26,FALSE)","v":""},{"$f":"VLOOKUP(A9,September!A:AC,25,FALSE)","v":0}]
["3.9.",{"$f":"VLOOKUP(A10,September!A:Z,2,FALSE)","v":"So"},{"$f":"VLOOKUP(A10,September!A:Y,21,FALSE)","v":0},{"$f":"VLOOKUP(A10,September!A:Z,17,FALSE)","v":0},{"$f":"VLOOKUP(A10,September!A:Z,18,FALSE)","v":0},{"$f":"VLOOKUP(A10,September!A:AA,20,FALSE)","v":0},{"$f":"VLOOKUP(A10,September!A:AB,26,FALSE)","v":""},{"$f":"VLOOKUP(A10,September!A:AC,25,FALSE)","v":0}]
["4.9.",{"$f":"VLOOKUP(A11,September!A:Z,2,FALSE)","v":"Mo"},{"$f":"VLOOKUP(A11,September!A:Y,21,FALSE)","v":0},{"$f":"VLOOKUP(A11,September!A:Z,17,FALSE)","v":0},{"$f":"VLOOKUP(A11,September!A:Z,18,FALSE)","v":0},{"$f":"VLOOKUP(A11,September!A:AA,20,FALSE)","v":0},{"$f":"VLOOKUP(A11,September!A:AB,26,FALSE)","v":""},{"$f":"VLOOKUP(A11,September!A:AC,25,FALSE)","v":0}]
["5.9.",{"$f":"VLOOKUP(A12,September!A:Z,2,FALSE)","v":"Die"},{"$f":"VLOOKUP(A12,September!A:Y,21,FALSE)","v":0},{"$f":"VLOOKUP(A12,September!A:Z,17,FALSE)","v":0},{"$f":"VLOOKUP(A12,September!A:Z,18,FALSE)","v":0},{"$f":"VLOOKUP(A12,September!A:AA,20,FALSE)","v":0},{"$f":"VLOOKUP(A12,September!A:AB,26,FALSE)","v":""},{"$f":"VLOOKUP(A12,September!A:AC,25,FALSE)","v":0}]
["6.9.",{"$f":"VLOOKUP(A13,September!A:Z,2,FALSE)","v":"Mi"},{"$f":"VLOOKUP(A13,September!A:Y,21,FALSE)","v":0},{"$f":"VLOOKUP(A13,September!A:Z,17,FALSE)","v":0},{"$f":"VLOOKUP(A13,September!A:Z,18,FALSE)","v":0},{"$f":"VLOOKUP(A13,September!A:AA,20,FALSE)","v":0},{"$f":"VLOOKUP(A13,September!A:AB,26,FALSE)","v":""},{"$f":"VLOOKUP(A13,September!A:AC,25,FALSE)","v":0}]
["7.9.",{"$f":"VLOOKUP(A14,September!A:Z,2,FALSE)","v":"Do"},{"$f":"VLOOKUP(A14,September!A:Y,21,FALSE)","v":0},{"$f":"VLOOKUP(A14,September!A:Z,17,FALSE)","v":0},{"$f":"VLOOKUP(A14,September!A:Z,18,FALSE)","v":0},{"$f":"VLOOKUP(A14,September!A:AA,20,FALSE)","v":0},{"$f":"VLOOKUP(A14,September!A:AB,26,FALSE)","v":""},{"$f":"VLOOKUP(A14,September!A:AC,25,FALSE)","v":0}]
["8.9.",{"$f":"VLOOKUP(A15,September!A:Z,2,FALSE)","v":"Fr"},{"$f":"VLOOKUP(A15,September!A:Y,21,FALSE)","v":0},{"$f":"VLOOKUP(A15,September!A:Z,17,FALSE)","v":0},{"$f":"VLOOKUP(A15,September!A:Z,18,FALSE)","v":0},{"$f":"VLOOKUP(A15,September!A:AA,20,FALSE)","v":0},{"$f":"VLOOKUP(A15,September!A:AB,26,FALSE)","v":""},{"$f":"VLOOKUP(A15,September!A:AC,25,FALSE)","v":0}]
["9.9.",{"$f":"VLOOKUP(A16,September!A:Z,2,FALSE)","v":"Sa"},{"$f":"VLOOKUP(A16,September!A:Y,21,FALSE)","v":0},{"$f":"VLOOKUP(A16,September!A:Z,17,FALSE)","v":0},{"$f":"VLOOKUP(A16,September!A:Z,18,FALSE)","v":0},{"$f":"VLOOKUP(A16,September!A:AA,20,FALSE)","v":0},{"$f":"VLOOKUP(A16,September!A:AB,26,FALSE)","v":""},{"$f":"VLOOKUP(A16,September!A:AC,25,FALSE)","v":0}]
["10.9.",{"$f":"VLOOKUP(A17,September!A:Z,2,FALSE)","v":"So"},{"$f":"VLOOKUP(A17,September!A:Y,21,FALSE)","v":0},{"$f":"VLOOKUP(A17,September!A:Z,17,FALSE)","v":0},{"$f":"VLOOKUP(A17,September!A:Z,18,FALSE)","v":0},{"$f":"VLOOKUP(A17,September!A:AA,20,FALSE)","v":0},{"$f":"VLOOKUP(A17,September!A:AB,26,FALSE)","v":""},{"$f":"VLOOKUP(A17,September!A:AC,25,FALSE)","v":0}]
["11.9.",{"$f":"VLOOKUP(A18,September!A:Z,2,FALSE)","v":"Mo"},{"$f":"VLOOKUP(A18,September!A:Y,21,FALSE)","v":0},{"$f":"VLOOKUP(A18,September!A:Z,17,FALSE)","v":0},{"$f":"VLOOKUP(A18,September!A:Z,18,FALSE)","v":0},{"$f":"VLOOKUP(A18,September!A:AA,20,FALSE)","v":0},{"$f":"VLOOKUP(A18,September!A:AB,26,FALSE)","v":""},{"$f":"VLOOKUP(A18,September!A:AC,25,FALSE)","v":0}]
["12.9.",{"$f":"VLOOKUP(A19,September!A:Z,2,FALSE)","v":"Die"},{"$f":"VLOOKUP(A19,September!A:Y,21,FALSE)","v":0},{"$f":"VLOOKUP(A19,September!A:Z,17,FALSE)","v":0},{"$f":"VLOOKUP(A19,September!A:Z,18,FALSE)","v":0},{"$f":"VLOOKUP(A19,September!A:AA,20,FALSE)","v":0},{"$f":"VLOOKUP(A19,September!A:AB,26,FALSE)","v":""},{"$f":"VLOOKUP(A19,September!A:AC,25,FALSE)","v":0}]
["13.9.",{"$f":"VLOOKUP(A20,September!A:Z,2,FALSE)","v":"Mi"},{"$f":"VLOOKUP(A20,September!A:Y,21,FALSE)","v":0},{"$f":"VLOOKUP(A20,September!A:Z,17,FALSE)","v":0},{"$f":"VLOOKUP(A20,September!A:Z,18,FALSE)","v":0},{"$f":"VLOOKUP(A20,September!A:AA,20,FALSE)","v":0},{"$f":"VLOOKUP(A20,September!A:AB,26,FALSE)","v":""},{"$f":"VLOOKUP(A20,September!A:AC,25,FALSE)","v":0}]
["14.9.",{"$f":"VLOOKUP(A21,September!A:Z,2,FALSE)","v":"Do"},{"$f":"VLOOKUP(A21,September!A:Y,21,FALSE)","v":0},{"$f":"VLOOKUP(A21,September!A:Z,17,FALSE)","v":0},{"$f":"VLOOKUP(A21,September!A:Z,18,FALSE)","v":0},{"$f":"VLOOKUP(A21,September!A:AA,20,FALSE)","v":0},{"$f":"VLOOKUP(A21,September!A:AB,26,FALSE)","v":""},{"$f":"VLOOKUP(A21,September!A:AC,25,FALSE)","v":0}]
["15.9.",{"$f":"VLOOKUP(A22,September!A:Z,2,FALSE)","v":"Fr"},{"$f":"VLOOKUP(A22,September!A:Y,21,FALSE)","v":0},{"$f":"VLOOKUP(A22,September!A:Z,17,FALSE)","v":0},{"$f":"VLOOKUP(A22,September!A:Z,18,FALSE)","v":0},{"$f":"VLOOKUP(A22,September!A:AA,20,FALSE)","v":0},{"$f":"VLOOKUP(A22,September!A:AB,26,FALSE)","v":""},{"$f":"VLOOKUP(A22,September!A:AC,25,FALSE)","v":0}]
["16.9.",{"$f":"VLOOKUP(A23,September!A:Z,2,FALSE)","v":"Sa"},{"$f":"VLOOKUP(A23,September!A:Y,21,FALSE)","v":0},{"$f":"VLOOKUP(A23,September!A:Z,17,FALSE)","v":0},{"$f":"VLOOKUP(A23,September!A:Z,18,FALSE)","v":0},{"$f":"VLOOKUP(A23,September!A:AA,20,FALSE)","v":0},{"$f":"VLOOKUP(A23,September!A:AB,26,FALSE)","v":""},{"$f":"VLOOKUP(A23,September!A:AC,25,FALSE)","v":0}]
["17.9.",{"$f":"VLOOKUP(A24,September!A:Z,2,FALSE)","v":"So"},{"$f":"VLOOKUP(A24,September!A:Y,21,FALSE)","v":0},{"$f":"VLOOKUP(A24,September!A:Z,17,FALSE)","v":0},{"$f":"VLOOKUP(A24,September!A:Z,18,FALSE)","v":0},{"$f":"VLOOKUP(A24,September!A:AA,20,FALSE)","v":0},{"$f":"VLOOKUP(A24,September!A:AB,26,FALSE)","v":""},{"$f":"VLOOKUP(A24,September!A:AC,25,FALSE)","v":0}]
["18.9.",{"$f":"VLOOKUP(A25,September!A:Z,2,FALSE)","v":"Mo"},{"$f":"VLOOKUP(A25,September!A:Y,21,FALSE)","v":0},{"$f":"VLOOKUP(A25,September!A:Z,17,FALSE)","v":0},{"$f":"VLOOKUP(A25,September!A:Z,18,FALSE)","v":0},{"$f":"VLOOKUP(A25,September!A:AA,20,FALSE)","v":0},{"$f":"VLOOKUP(A25,September!A:AB,26,FALSE)","v":""},{"$f":"VLOOKUP(A25,September!A:AC,25,FALSE)","v":0}]
["19.9.",{"$f":"VLOOKUP(A26,September!A:Z,2,FALSE)","v":"Die"},{"$f":"VLOOKUP(A26,September!A:Y,21,FALSE)","v":0},{"$f":"VLOOKUP(A26,September!A:Z,17,FALSE)","v":0},{"$f":"VLOOKUP(A26,September!A:Z,18,FALSE)","v":0},{"$f":"VLOOKUP(A26,September!A:AA,20,FALSE)","v":0},{"$f":"VLOOKUP(A26,September!A:AB,26,FALSE)","v":""},{"$f":"VLOOKUP(A26,September!A:AC,25,FALSE)","v":0}]
["20.9.",{"$f":"VLOOKUP(A27,September!A:Z,2,FALSE)","v":"Mi"},{"$f":"VLOOKUP(A27,September!A:Y,21,FALSE)","v":0},{"$f":"VLOOKUP(A27,September!A:Z,17,FALSE)","v":0},{"$f":"VLOOKUP(A27,September!A:Z,18,FALSE)","v":0},{"$f":"VLOOKUP(A27,September!A:AA,20,FALSE)","v":0},{"$f":"VLOOKUP(A27,September!A:AB,26,FALSE)","v":""},{"$f":"VLOOKUP(A27,September!A:AC,25,FALSE)","v":0}]
["21.9.",{"$f":"VLOOKUP(A28,September!A:Z,2,FALSE)","v":"Do"},{"$f":"VLOOKUP(A28,September!A:Y,21,FALSE)","v":0},{"$f":"VLOOKUP(A28,September!A:Z,17,FALSE)","v":0},{"$f":"VLOOKUP(A28,September!A:Z,18,FALSE)","v":0},{"$f":"VLOOKUP(A28,September!A:AA,20,FALSE)","v":0},{"$f":"VLOOKUP(A28,September!A:AB,26,FALSE)","v":""},{"$f":"VLOOKUP(A28,September!A:AC,25,FALSE)","v":0}]
["22.9.",{"$f":"VLOOKUP(A29,September!A:Z,2,FALSE)","v":"Fr"},{"$f":"VLOOKUP(A29,September!A:Y,21,FALSE)","v":0},{"$f":"VLOOKUP(A29,September!A:Z,17,FALSE)","v":0},{"$f":"VLOOKUP(A29,September!A:Z,18,FALSE)","v":0},{"$f":"VLOOKUP(A29,September!A:AA,20,FALSE)","v":0},{"$f":"VLOOKUP(A29,September!A:AB,26,FALSE)","v":""},{"$f":"VLOOKUP(A29,September!A:AC,25,FALSE)","v":0}]
["23.9.",{"$f":"VLOOKUP(A30,September!A:Z,2,FALSE)","v":"Sa"},{"$f":"VLOOKUP(A30,September!A:Y,21,FALSE)","v":0},{"$f":"VLOOKUP(A30,September!A:Z,17,FALSE)","v":0},{"$f":"VLOOKUP(A30,September!A:Z,18,FALSE)","v":0},{"$f":"VLOOKUP(A30,September!A:AA,20,FALSE)","v":0},{"$f":"VLOOKUP(A30,September!A:AB,26,FALSE)","v":""},{"$f":"VLOOKUP(A30,September!A:AC,25,FALSE)","v":0}]
["24.9.",{"$f":"VLOOKUP(A31,September!A:Z,2,FALSE)","v":"So"},{"$f":"VLOOKUP(A31,September!A:Y,21,FALSE)","v":0},{"$f":"VLOOKUP(A31,September!A:Z,17,FALSE)","v":0},{"$f":"VLOOKUP(A31,September!A:Z,18,FALSE)","v":0},{"$f":"VLOOKUP(A31,September!A:AA,20,FALSE)","v":0},{"$f":"VLOOKUP(A31,September!A:AB,26,FALSE)","v":""},{"$f":"VLOOKUP(A31,September!A:AC,25,FALSE)","v":0}]
["25.9.",{"$f":"VLOOKUP(A32,September!A:Z,2,FALSE)","v":"Mo"},{"$f":"VLOOKUP(A32,September!A:Y,21,FALSE)","v":0},{"$f":"VLOOKUP(A32,September!A:Z,17,FALSE)","v":0},{"$f":"VLOOKUP(A32,September!A:Z,18,FALSE)","v":0},{"$f":"VLOOKUP(A32,September!A:AA,20,FALSE)","v":0},{"$f":"VLOOKUP(A32,September!A:AB,26,FALSE)","v":""},{"$f":"VLOOKUP(A32,September!A:AC,25,FALSE)","v":0}]
["26.9.",{"$f":"VLOOKUP(A33,September!A:Z,2,FALSE)","v":"Die"},{"$f":"VLOOKUP(A33,September!A:Y,21,FALSE)","v":0},{"$f":"VLOOKUP(A33,September!A:Z,17,FALSE)","v":0},{"$f":"VLOOKUP(A33,September!A:Z,18,FALSE)","v":0},{"$f":"VLOOKUP(A33,September!A:AA,20,FALSE)","v":0},{"$f":"VLOOKUP(A33,September!A:AB,26,FALSE)","v":""},{"$f":"VLOOKUP(A33,September!A:AC,25,FALSE)","v":0}]
["27.9.",{"$f":"VLOOKUP(A34,September!A:Z,2,FALSE)","v":"Mi"},{"$f":"VLOOKUP(A34,September!A:Y,21,FALSE)","v":0},{"$f":"VLOOKUP(A34,September!A:Z,17,FALSE)","v":0},{"$f":"VLOOKUP(A34,September!A:Z,18,FALSE)","v":0},{"$f":"VLOOKUP(A34,September!A:AA,20,FALSE)","v":0},{"$f":"VLOOKUP(A34,September!A:AB,26,FALSE)","v":""},{"$f":"VLOOKUP(A34,September!A:AC,25,FALSE)","v":0}]
["28.9.",{"$f":"VLOOKUP(A35,September!A:Z,2,FALSE)","v":"Do"},{"$f":"VLOOKUP(A35,September!A:Y,21,FALSE)","v":0},{"$f":"VLOOKUP(A35,September!A:Z,17,FALSE)","v":0},{"$f":"VLOOKUP(A35,September!A:Z,18,FALSE)","v":0},{"$f":"VLOOKUP(A35,September!A:AA,20,FALSE)","v":0},{"$f":"VLOOKUP(A35,September!A:AB,26,FALSE)","v":""},{"$f":"VLOOKUP(A35,September!A:AC,25,FALSE)","v":0}]
["29.9.",{"$f":"VLOOKUP(A36,September!A:Z,2,FALSE)","v":"Fr"},{"$f":"VLOOKUP(A36,September!A:Y,21,FALSE)","v":0},{"$f":"VLOOKUP(A36,September!A:Z,17,FALSE)","v":0},{"$f":"VLOOKUP(A36,September!A:Z,18,FALSE)","v":0},{"$f":"VLOOKUP(A36,September!A:AA,20,FALSE)","v":0},{"$f":"VLOOKUP(A36,September!A:AB,26,FALSE)","v":""},{"$f":"VLOOKUP(A36,September!A:AC,25,FALSE)","v":0}]
["30.9.",{"$f":"VLOOKUP(A37,September!A:Z,2,FALSE)","v":"Sa"},{"$f":"VLOOKUP(A37,September!A:Y,21,FALSE)","v":0},{"$f":"VLOOKUP(A37,September!A:Z,17,FALSE)","v":0},{"$f":"VLOOKUP(A37,September!A:Z,18,FALSE)","v":0},{"$f":"VLOOKUP(A37,September!A:AA,20,FALSE)","v":0},{"$f":"VLOOKUP(A37,September!A:AB,26,FALSE)","v":""},{"$f":"VLOOKUP(A37,September!A:AC,25,FALSE)","v":0}]
[]
["1) Die Anzeige von \"Fehler\" in Spalte G erscheint, wenn im Arbeitsblatt des entsprechenden Monats: 1. Arbeitszeit und Urlaub erfasst wurde;  2. Urlaub und Krankheit jeweils eingegeben wurde und wenn 3. in der Erfassungstabelle (Monat) an Krankheitstagen Arbeitszeit eingetragen wurde.    Hintergrund: Im Urlaub oder bei Krankheit kann nicht gearbeitet werden."]
["2) An Krankheitstagen erscheint in dieser Tabelle dennoch eine Zahl bei der Arbeitszeit. Krankheit wird in AZ umgerechnet und erhöht die IST-AZ.; Bei der \"Fehler\"anzeige wurde Arbeitszeit in den Spalten C bis O (Monatsblatt) eingetragen."]
[]
["Zum Arbeitsblatt:",null,null,"SEPTEMBER"]

{"sheet":"Oktober-Druck","index":26,"n_rows":43,"n_cols":8,"rows_kept":43,"cut":false,"hidden":false,"merged":[[42,0,42,2],[42,3,42,4],[0,0,0,1],[2,6,5,6],[5,0,5,1],[39,0,39,7],[40,0,40,7]]}
[{"$f":"Oktober!V1","v":"OKTOBER"},null,{"$f":"Stammdaten!C2","v":2023},null,null,null,null,{"$f":"Stammdaten!B3","v":0}]
["JAZ",null,{"$f":"Stammdaten!B26","v":1287}]
["Jahres-IST",null,{"$f":"Oktober!U5","v":0}]
["Verbleibende AZ",null,{"$f":"Oktober!W44","v":1287}]
["Urlaub im Monat",null,{"$f":"Oktober!Q45","v":0}]
["Resturlaub zum Ende des Monats",null,{"$f":"Oktober!Q5","v":30}]
["Datum","Tag","AZ","Urlaub","Krank/\nFreistellung","Ort","Plausibilität","Anmerkungen"]
["1.10.",{"$f":"VLOOKUP(A8,Oktober!A:Z,2,FALSE)","v":"So"},{"$f":"VLOOKUP(A8,Oktober!A:Y,21,FALSE)","v":0},{"$f":"VLOOKUP(A8,Oktober!A:Z,17,FALSE)","v":0},{"$f":"VLOOKUP(A8,Oktober!A:Z,18,FALSE)","v":0},{"$f":"VLOOKUP(A8,Oktober!A:AA,20,FALSE)","v":0},{"$f":"VLOOKUP(A8,Oktober!A:AB,26,FALSE)","v":""},{"$f":"VLOOKUP(A8,Oktober!A:AC,25,FALSE)","v":0}]
["2.10.",{"$f":"VLOOKUP(A9,Oktober!A:Z,2,FALSE)","v":"Mo"},{"$f":"VLOOKUP(A9,Oktober!A:Y,21,FALSE)","v":0},{"$f":"VLOOKUP(A9,Oktober!A:Z,17,FALSE)","v":0},{"$f":"VLOOKUP(A9,Oktober!A:Z,18,FALSE)","v":0},{"$f":"VLOOKUP(A9,Oktober!A:AA,20,FALSE)","v":0},{"$f":"VLOOKUP(A9,Oktober!A:AB,26,FALSE)","v":""},{"$f":"VLOOKUP(A9,Oktober!A:AC,25,FALSE)","v":0}]
["3.10.",{"$f":"VLOOKUP(A10,Oktober!A:Z,2,FALSE)","v":"Die"},{"$f":"VLOOKUP(A10,Oktober!A:Y,21,FALSE)","v":0},{"$f":"VLOOKUP(A10,Oktober!A:Z,17,FALSE)","v":0},{"$f":"VLOOKUP(A10,Oktober!A:Z,18,FALSE)","v":0},{"$f":"VLOOKUP(A10,Oktober!A:AA,20,FALSE)","v":0},{"$f":"VLOOKUP(A10,Oktober!A:AB,26,FALSE)","v":""},{"$f":"VLOOKUP(A10,Oktober!A:AC,25,FALSE)","v":0}]
["4.10.",{"$f":"VLOOKUP(A11,Oktober!A:Z,2,FALSE)","v":"Mi"},{"$f":"VLOOKUP(A11,Oktober!A:Y,21,FALSE)","v":0},{"$f":"VLOOKUP(A11,Oktober!A:Z,17,FALSE)","v":0},{"$f":"VLOOKUP(A11,Oktober!A:Z,18,FALSE)","v":0},{"$f":"VLOOKUP(A11,Oktober!A:AA,20,FALSE)","v":0},{"$f":"VLOOKUP(A11,Oktober!A:AB,26,FALSE)","v":""},{"$f":"VLOOKUP(A11,Oktober!A:AC,25,FALSE)","v":0}]
["5.10.",{"$f":"VLOOKUP(A12,Oktober!A:Z,2,FALSE)","v":"Do"},{"$f":"VLOOKUP(A12,Oktober!A:Y,21,FALSE)","v":0},{"$f":"VLOOKUP(A12,Oktober!A:Z,17,FALSE)","v":0},{"$f":"VLOOKUP(A12,Oktober!A:Z,18,FALSE)","v":0},{"$f":"VLOOKUP(A12,Oktober!A:AA,20,FALSE)","v":0},{"$f":"VLOOKUP(A12,Oktober!A:AB,26,FALSE)","v":""},{"$f":"VLOOKUP(A12,Oktober!A:AC,25,FALSE)","v":0}]
["6.10.",{"$f":"VLOOKUP(A13,Oktober!A:Z,2,FALSE)","v":"Fr"},{"$f":"VLOOKUP(A13,Oktober!A:Y,21,FALSE)","v":0},{"$f":"VLOOKUP(A13,Oktober!A:Z,17,FALSE)","v":0},{"$f":"VLOOKUP(A13,Oktober!A:Z,18,FALSE)","v":0},{"$f":"VLOOKUP(A13,Oktober!A:AA,20,FALSE)","v":0},{"$f":"VLOOKUP(A13,Oktober!A:AB,26,FALSE)","v":""},{"$f":"VLOOKUP(A13,Oktober!A:AC,25,FALSE)","v":0}]
["7.10.",{"$f":"VLOOKUP(A14,Oktober!A:Z,2,FALSE)","v":"Sa"},{"$f":"VLOOKUP(A14,Oktober!A:Y,21,FALSE)","v":0},{"$f":"VLOOKUP(A14,Oktober!A:Z,17,FALSE)","v":0},{"$f":"VLOOKUP(A14,Oktober!A:Z,18,FALSE)","v":0},{"$f":"VLOOKUP(A14,Oktober!A:AA,20,FALSE)","v":0},{"$f":"VLOOKUP(A14,Oktober!A:AB,26,FALSE)","v":""},{"$f":"VLOOKUP(A14,Oktober!A:AC,25,FALSE)","v":0}]
["8.10.",{"$f":"VLOOKUP(A15,Oktober!A:Z,2,FALSE)","v":"So"},{"$f":"VLOOKUP(A15,Oktober!A:Y,21,FALSE)","v":0},{"$f":"VLOOKUP(A15,Oktober!A:Z,17,FALSE)","v":0},{"$f":"VLOOKUP(A15,Oktober!A:Z,18,FALSE)","v":0},{"$f":"VLOOKUP(A15,Oktober!A:AA,20,FALSE)","v":0},{"$f":"VLOOKUP(A15,Oktober!A:AB,26,FALSE)","v":""},{"$f":"VLOOKUP(A15,Oktober!A:AC,25,FALSE)","v":0}]
["9.10.",{"$f":"VLOOKUP(A16,Oktober!A:Z,2,FALSE)","v":"Mo"},{"$f":"VLOOKUP(A16,Oktober!A:Y,21,FALSE)","v":0},{"$f":"VLOOKUP(A16,Oktober!A:Z,17,FALSE)","v":0},{"$f":"VLOOKUP(A16,Oktober!A:Z,18,FALSE)","v":0},{"$f":"VLOOKUP(A16,Oktober!A:AA,20,FALSE)","v":0},{"$f":"VLOOKUP(A16,Oktober!A:AB,26,FALSE)","v":""},{"$f":"VLOOKUP(A16,Oktober!A:AC,25,FALSE)","v":0}]
["10.10.",{"$f":"VLOOKUP(A17,Oktober!A:Z,2,FALSE)","v":"Die"},{"$f":"VLOOKUP(A17,Oktober!A:Y,21,FALSE)","v":0},{"$f":"VLOOKUP(A17,Oktober!A:Z,17,FALSE)","v":0},{"$f":"VLOOKUP(A17,Oktober!A:Z,18,FALSE)","v":0},{"$f":"VLOOKUP(A17,Oktober!A:AA,20,FALSE)","v":0},{"$f":"VLOOKUP(A17,Oktober!A:AB,26,FALSE)","v":""},{"$f":"VLOOKUP(A17,Oktober!A:AC,25,FALSE)","v":0}]
["11.10.",{"$f":"VLOOKUP(A18,Oktober!A:Z,2,FALSE)","v":"Mi"},{"$f":"VLOOKUP(A18,Oktober!A:Y,21,FALSE)","v":0},{"$f":"VLOOKUP(A18,Oktober!A:Z,17,FALSE)","v":0},{"$f":"VLOOKUP(A18,Oktober!A:Z,18,FALSE)","v":0},{"$f":"VLOOKUP(A18,Oktober!A:AA,20,FALSE)","v":0},{"$f":"VLOOKUP(A18,Oktober!A:AB,26,FALSE)","v":""},{"$f":"VLOOKUP(A18,Oktober!A:AC,25,FALSE)","v":0}]
["12.10.",{"$f":"VLOOKUP(A19,Oktober!A:Z,2,FALSE)","v":"Do"},{"$f":"VLOOKUP(A19,Oktober!A:Y,21,FALSE)","v":0},{"$f":"VLOOKUP(A19,Oktober!A:Z,17,FALSE)","v":0},{"$f":"VLOOKUP(A19,Oktober!A:Z,18,FALSE)","v":0},{"$f":"VLOOKUP(A19,Oktober!A:AA,20,FALSE)","v":0},{"$f":"VLOOKUP(A19,Oktober!A:AB,26,FALSE)","v":""},{"$f":"VLOOKUP(A19,Oktober!A:AC,25,FALSE)","v":0}]
["13.10.",{"$f":"VLOOKUP(A20,Oktober!A:Z,2,FALSE)","v":"Fr"},{"$f":"VLOOKUP(A20,Oktober!A:Y,21,FALSE)","v":0},{"$f":"VLOOKUP(A20,Oktober!A:Z,17,FALSE)","v":0},{"$f":"VLOOKUP(A20,Oktober!A:Z,18,FALSE)","v":0},{"$f":"VLOOKUP(A20,Oktober!A:AA,20,FALSE)","v":0},{"$f":"VLOOKUP(A20,Oktober!A:AB,26,FALSE)","v":""},{"$f":"VLOOKUP(A20,Oktober!A:AC,25,FALSE)","v":0}]
["14.10.",{"$f":"VLOOKUP(A21,Oktober!A:Z,2,FALSE)","v":"Sa"},{"$f":"VLOOKUP(A21,Oktober!A:Y,21,FALSE)","v":0},{"$f":"VLOOKUP(A21,Oktober!A:Z,17,FALSE)","v":0},{"$f":"VLOOKUP(A21,Oktober!A:Z,18,FALSE)","v":0},{"$f":"VLOOKUP(A21,Oktober!A:AA,20,FALSE)","v":0},{"$f":"VLOOKUP(A21,Oktober!A:AB,26,FALSE)","v":""},{"$f":"VLOOKUP(A21,Oktober!A:AC,25,FALSE)","v":0}]
["15.10.",{"$f":"VLOOKUP(A22,Oktober!A:Z,2,FALSE)","v":"So"},{"$f":"VLOOKUP(A22,Oktober!A:Y,21,FALSE)","v":0},{"$f":"VLOOKUP(A22,Oktober!A:Z,17,FALSE)","v":0},{"$f":"VLOOKUP(A22,Oktober!A:Z,18,FALSE)","v":0},{"$f":"VLOOKUP(A22,Oktober!A:AA,20,FALSE)","v":0},{"$f":"VLOOKUP(A22,Oktober!A:AB,26,FALSE)","v":""},{"$f":"VLOOKUP(A22,Oktober!A:AC,25,FALSE)","v":0}]
["16.10.",{"$f":"VLOOKUP(A23,Oktober!A:Z,2,FALSE)","v":"Mo"},{"$f":"VLOOKUP(A23,Oktober!A:Y,21,FALSE)","v":0},{"$f":"VLOOKUP(A23,Oktober!A:Z,17,FALSE)","v":0},{"$f":"VLOOKUP(A23,Oktober!A:Z,18,FALSE)","v":0},{"$f":"VLOOKUP(A23,Oktober!A:AA,20,FALSE)","v":0},{"$f":"VLOOKUP(A23,Oktober!A:AB,26,FALSE)","v":""},{"$f":"VLOOKUP(A23,Oktober!A:AC,25,FALSE)","v":0}]
["17.10.",{"$f":"VLOOKUP(A24,Oktober!A:Z,2,FALSE)","v":"Die"},{"$f":"VLOOKUP(A24,Oktober!A:Y,21,FALSE)","v":0},{"$f":"VLOOKUP(A24,Oktober!A:Z,17,FALSE)","v":0},{"$f":"VLOOKUP(A24,Oktober!A:Z,18,FALSE)","v":0},{"$f":"VLOOKUP(A24,Oktober!A:AA,20,FALSE)","v":0},{"$f":"VLOOKUP(A24,Oktober!A:AB,26,FALSE)","v":""},{"$f":"VLOOKUP(A24,Oktober!A:AC,25,FALSE)","v":0}]
["18.10.",{"$f":"VLOOKUP(A25,Oktober!A:Z,2,FALSE)","v":"Mi"},{"$f":"VLOOKUP(A25,Oktober!A:Y,21,FALSE)","v":0},{"$f":"VLOOKUP(A25,Oktober!A:Z,17,FALSE)","v":0},{"$f":"VLOOKUP(A25,Oktober!A:Z,18,FALSE)","v":0},{"$f":"VLOOKUP(A25,Oktober!A:AA,20,FALSE)","v":0},{"$f":"VLOOKUP(A25,Oktober!A:AB,26,FALSE)","v":""},{"$f":"VLOOKUP(A25,Oktober!A:AC,25,FALSE)","v":0}]
["19.10.",{"$f":"VLOOKUP(A26,Oktober!A:Z,2,FALSE)","v":"Do"},{"$f":"VLOOKUP(A26,Oktober!A:Y,21,FALSE)","v":0},{"$f":"VLOOKUP(A26,Oktober!A:Z,17,FALSE)","v":0},{"$f":"VLOOKUP(A26,Oktober!A:Z,18,FALSE)","v":0},{"$f":"VLOOKUP(A26,Oktober!A:AA,20,FALSE)","v":0},{"$f":"VLOOKUP(A26,Oktober!A:AB,26,FALSE)","v":""},{"$f":"VLOOKUP(A26,Oktober!A:AC,25,FALSE)","v":0}]
["20.10.",{"$f":"VLOOKUP(A27,Oktober!A:Z,2,FALSE)","v":"Fr"},{"$f":"VLOOKUP(A27,Oktober!A:Y,21,FALSE)","v":0},{"$f":"VLOOKUP(A27,Oktober!A:Z,17,FALSE)","v":0},{"$f":"VLOOKUP(A27,Oktober!A:Z,18,FALSE)","v":0},{"$f":"VLOOKUP(A27,Oktober!A:AA,20,FALSE)","v":0},{"$f":"VLOOKUP(A27,Oktober!A:AB,26,FALSE)","v":""},{"$f":"VLOOKUP(A27,Oktober!A:AC,25,FALSE)","v":0}]
["21.10.",{"$f":"VLOOKUP(A28,Oktober!A:Z,2,FALSE)","v":"Sa"},{"$f":"VLOOKUP(A28,Oktober!A:Y,21,FALSE)","v":0},{"$f":"VLOOKUP(A28,Oktober!A:Z,17,FALSE)","v":0},{"$f":"VLOOKUP(A28,Oktober!A:Z,18,FALSE)","v":0},{"$f":"VLOOKUP(A28,Oktober!A:AA,20,FALSE)","v":0},{"$f":"VLOOKUP(A28,Oktober!A:AB,26,FALSE)","v":""},{"$f":"VLOOKUP(A28,Oktober!A:AC,25,FALSE)","v":0}]
["22.10.",{"$f":"VLOOKUP(A29,Oktober!A:Z,2,FALSE)","v":"So"},{"$f":"VLOOKUP(A29,Oktober!A:Y,21,FALSE)","v":0},{"$f":"VLOOKUP(A29,Oktober!A:Z,17,FALSE)","v":0},{"$f":"VLOOKUP(A29,Oktober!A:Z,18,FALSE)","v":0},{"$f":"VLOOKUP(A29,Oktober!A:AA,20,FALSE)","v":0},{"$f":"VLOOKUP(A29,Oktober!A:AB,26,FALSE)","v":""},{"$f":"VLOOKUP(A29,Oktober!A:AC,25,FALSE)","v":0}]
["23.10.",{"$f":"VLOOKUP(A30,Oktober!A:Z,2,FALSE)","v":"Mo"},{"$f":"VLOOKUP(A30,Oktober!A:Y,21,FALSE)","v":0},{"$f":"VLOOKUP(A30,Oktober!A:Z,17,FALSE)","v":0},{"$f":"VLOOKUP(A30,Oktober!A:Z,18,FALSE)","v":0},{"$f":"VLOOKUP(A30,Oktober!A:AA,20,FALSE)","v":0},{"$f":"VLOOKUP(A30,Oktober!A:AB,26,FALSE)","v":""},{"$f":"VLOOKUP(A30,Oktober!A:AC,25,FALSE)","v":0}]
["24.10.",{"$f":"VLOOKUP(A31,Oktober!A:Z,2,FALSE)","v":"Die"},{"$f":"VLOOKUP(A31,Oktober!A:Y,21,FALSE)","v":0},{"$f":"VLOOKUP(A31,Oktober!A:Z,17,FALSE)","v":0},{"$f":"VLOOKUP(A31,Oktober!A:Z,18,FALSE)","v":0},{"$f":"VLOOKUP(A31,Oktober!A:AA,20,FALSE)","v":0},{"$f":"VLOOKUP(A31,Oktober!A:AB,26,FALSE)","v":""},{"$f":"VLOOKUP(A31,Oktober!A:AC,25,FALSE)","v":0}]
["25.10.",{"$f":"VLOOKUP(A32,Oktober!A:Z,2,FALSE)","v":"Mi"},{"$f":"VLOOKUP(A32,Oktober!A:Y,21,FALSE)","v":0},{"$f":"VLOOKUP(A32,Oktober!A:Z,17,FALSE)","v":0},{"$f":"VLOOKUP(A32,Oktober!A:Z,18,FALSE)","v":0},{"$f":"VLOOKUP(A32,Oktober!A:AA,20,FALSE)","v":0},{"$f":"VLOOKUP(A32,Oktober!A:AB,26,FALSE)","v":""},{"$f":"VLOOKUP(A32,Oktober!A:AC,25,FALSE)","v":0}]
["26.10.",{"$f":"VLOOKUP(A33,Oktober!A:Z,2,FALSE)","v":"Do"},{"$f":"VLOOKUP(A33,Oktober!A:Y,21,FALSE)","v":0},{"$f":"VLOOKUP(A33,Oktober!A:Z,17,FALSE)","v":0},{"$f":"VLOOKUP(A33,Oktober!A:Z,18,FALSE)","v":0},{"$f":"VLOOKUP(A33,Oktober!A:AA,20,FALSE)","v":0},{"$f":"VLOOKUP(A33,Oktober!A:AB,26,FALSE)","v":""},{"$f":"VLOOKUP(A33,Oktober!A:AC,25,FALSE)","v":0}]
["27.10.",{"$f":"VLOOKUP(A34,Oktober!A:Z,2,FALSE)","v":"Fr"},{"$f":"VLOOKUP(A34,Oktober!A:Y,21,FALSE)","v":0},{"$f":"VLOOKUP(A34,Oktober!A:Z,17,FALSE)","v":0},{"$f":"VLOOKUP(A34,Oktober!A:Z,18,FALSE)","v":0},{"$f":"VLOOKUP(A34,Oktober!A:AA,20,FALSE)","v":0},{"$f":"VLOOKUP(A34,Oktober!A:AB,26,FALSE)","v":""},{"$f":"VLOOKUP(A34,Oktober!A:AC,25,FALSE)","v":0}]
["28.10.",{"$f":"VLOOKUP(A35,Oktober!A:Z,2,FALSE)","v":"Sa"},{"$f":"VLOOKUP(A35,Oktober!A:Y,21,FALSE)","v":0},{"$f":"VLOOKUP(A35,Oktober!A:Z,17,FALSE)","v":0},{"$f":"VLOOKUP(A35,Oktober!A:Z,18,FALSE)","v":0},{"$f":"VLOOKUP(A35,Oktober!A:AA,20,FALSE)","v":0},{"$f":"VLOOKUP(A35,Oktober!A:AB,26,FALSE)","v":""},{"$f":"VLOOKUP(A35,Oktober!A:AC,25,FALSE)","v":0}]
["29.10.",{"$f":"VLOOKUP(A36,Oktober!A:Z,2,FALSE)","v":"So"},{"$f":"VLOOKUP(A36,Oktober!A:Y,21,FALSE)","v":0},{"$f":"VLOOKUP(A36,Oktober!A:Z,17,FALSE)","v":0},{"$f":"VLOOKUP(A36,Oktober!A:Z,18,FALSE)","v":0},{"$f":"VLOOKUP(A36,Oktober!A:AA,20,FALSE)","v":0},{"$f":"VLOOKUP(A36,Oktober!A:AB,26,FALSE)","v":""},{"$f":"VLOOKUP(A36,Oktober!A:AC,25,FALSE)","v":0}]
["30.10.",{"$f":"VLOOKUP(A37,Oktober!A:Z,2,FALSE)","v":"Mo"},{"$f":"VLOOKUP(A37,Oktober!A:Y,21,FALSE)","v":0},{"$f":"VLOOKUP(A37,Oktober!A:Z,17,FALSE)","v":0},{"$f":"VLOOKUP(A37,Oktober!A:Z,18,FALSE)","v":0},{"$f":"VLOOKUP(A37,Oktober!A:AA,20,FALSE)","v":0},{"$f":"VLOOKUP(A37,Oktober!A:AB,26,FALSE)","v":""},{"$f":"VLOOKUP(A37,Oktober!A:AC,25,FALSE)","v":0}]
["31.10.",{"$f":"VLOOKUP(A38,Oktober!A:Z,2,FALSE)","v":"Di"},{"$f":"VLOOKUP(A38,Oktober!A:Y,21,FALSE)","v":0},{"$f":"VLOOKUP(A38,Oktober!A:Z,17,FALSE)","v":0},{"$f":"VLOOKUP(A38,Oktober!A:Z,18,FALSE)","v":0},{"$f":"VLOOKUP(A38,Oktober!A:AA,20,FALSE)","v":0},{"$f":"VLOOKUP(A38,Oktober!A:AB,26,FALSE)","v":""},{"$f":"VLOOKUP(A38,Oktober!A:AC,25,FALSE)","v":0}]
[]
["1) Die Anzeige von \"Fehler\" in Spalte G erscheint, wenn im Arbeitsblatt des entsprechenden Monats: 1. Arbeitszeit und Urlaub erfasst wurde;  2. Urlaub und Krankheit jeweils eingegeben wurde und wenn 3. in der Erfassungstabelle (Monat) an Krankheitstagen Arbeitszeit eingetragen wurde.    Hintergrund: Im Urlaub oder bei Krankheit kann nicht gearbeitet werden."]
["2) An Krankheitstagen erscheint in dieser Tabelle dennoch eine Zahl bei der Arbeitszeit. Krankheit wird in AZ umgerechnet und erhöht die IST-AZ.; Bei der \"Fehler\"anzeige wurde Arbeitszeit in den Spalten C bis O (Monatsblatt) eingetragen."]
[]
["Zum Arbeitsblatt:",null,null,"OKTOBER"]

{"sheet":"November-Druck","index":27,"n_rows":42,"n_cols":8,"rows_kept":42,"cut":false,"hidden":false,"merged":[[41,0,41,2],[41,3,41,4],[0,0,0,1],[2,6,5,6],[5,0,5,1],[38,0,38,7],[39,0,39,7]]}
[{"$f":"November!V1","v":"NOVEMBER"},null,{"$f":"Stammdaten!C2","v":2023},null,null,null,null,{"$f":"Stammdaten!B3","v":0}]
["JAZ",null,{"$f":"Stammdaten!B26","v":1287}]
["Jahres-IST",null,{"$f":"November!U5","v":0}]
["Verbleibende AZ",null,{"$f":"November!W44","v":1287}]
["Urlaub im Monat",null,{"$f":"November!Q45","v":0}]
["Resturlaub zum Ende des Monats",null,{"$f":"November!Q5","v":30}]
["Datum","Tag","AZ","Urlaub","Krank/\nFreistellung","Ort","Plausibilität","Anmerkungen"]
["1.11.",{"$f":"VLOOKUP(A8,November!A:Z,2,FALSE)","v":"Mi"},{"$f":"VLOOKUP(A8,November!A:Y,21,FALSE)","v":0},{"$f":"VLOOKUP(A8,November!A:Z,17,FALSE)","v":0},{"$f":"VLOOKUP(A8,November!A:Z,18,FALSE)","v":0},{"$f":"VLOOKUP(A8,November!A:AA,20,FALSE)","v":0},{"$f":"VLOOKUP(A8,November!A:AB,26,FALSE)","v":""},{"$f":"VLOOKUP(A8,November!A:AC,25,FALSE)","v":0}]
["2.11.",{"$f":"VLOOKUP(A9,November!A:Z,2,FALSE)","v":"Do"},{"$f":"VLOOKUP(A9,November!A:Y,21,FALSE)","v":0},{"$f":"VLOOKUP(A9,November!A:Z,17,FALSE)","v":0},{"$f":"VLOOKUP(A9,November!A:Z,18,FALSE)","v":0},{"$f":"VLOOKUP(A9,November!A:AA,20,FALSE)","v":0},{"$f":"VLOOKUP(A9,November!A:AB,26,FALSE)","v":""},{"$f":"VLOOKUP(A9,November!A:AC,25,FALSE)","v":0}]
["3.11.",{"$f":"VLOOKUP(A10,November!A:Z,2,FALSE)","v":"Fr"},{"$f":"VLOOKUP(A10,November!A:Y,21,FALSE)","v":0},{"$f":"VLOOKUP(A10,November!A:Z,17,FALSE)","v":0},{"$f":"VLOOKUP(A10,November!A:Z,18,FALSE)","v":0},{"$f":"VLOOKUP(A10,November!A:AA,20,FALSE)","v":0},{"$f":"VLOOKUP(A10,November!A:AB,26,FALSE)","v":""},{"$f":"VLOOKUP(A10,November!A:AC,25,FALSE)","v":0}]
["4.11.",{"$f":"VLOOKUP(A11,November!A:Z,2,FALSE)","v":"Sa"},{"$f":"VLOOKUP(A11,November!A:Y,21,FALSE)","v":0},{"$f":"VLOOKUP(A11,November!A:Z,17,FALSE)","v":0},{"$f":"VLOOKUP(A11,November!A:Z,18,FALSE)","v":0},{"$f":"VLOOKUP(A11,November!A:AA,20,FALSE)","v":0},{"$f":"VLOOKUP(A11,November!A:AB,26,FALSE)","v":""},{"$f":"VLOOKUP(A11,November!A:AC,25,FALSE)","v":0}]
["5.11.",{"$f":"VLOOKUP(A12,November!A:Z,2,FALSE)","v":"So"},{"$f":"VLOOKUP(A12,November!A:Y,21,FALSE)","v":0},{"$f":"VLOOKUP(A12,November!A:Z,17,FALSE)","v":0},{"$f":"VLOOKUP(A12,November!A:Z,18,FALSE)","v":0},{"$f":"VLOOKUP(A12,November!A:AA,20,FALSE)","v":0},{"$f":"VLOOKUP(A12,November!A:AB,26,FALSE)","v":""},{"$f":"VLOOKUP(A12,November!A:AC,25,FALSE)","v":0}]
["6.11.",{"$f":"VLOOKUP(A13,November!A:Z,2,FALSE)","v":"Mo"},{"$f":"VLOOKUP(A13,November!A:Y,21,FALSE)","v":0},{"$f":"VLOOKUP(A13,November!A:Z,17,FALSE)","v":0},{"$f":"VLOOKUP(A13,November!A:Z,18,FALSE)","v":0},{"$f":"VLOOKUP(A13,November!A:AA,20,FALSE)","v":0},{"$f":"VLOOKUP(A13,November!A:AB,26,FALSE)","v":""},{"$f":"VLOOKUP(A13,November!A:AC,25,FALSE)","v":0}]
["7.11.",{"$f":"VLOOKUP(A14,November!A:Z,2,FALSE)","v":"Die"},{"$f":"VLOOKUP(A14,November!A:Y,21,FALSE)","v":0},{"$f":"VLOOKUP(A14,November!A:Z,17,FALSE)","v":0},{"$f":"VLOOKUP(A14,November!A:Z,18,FALSE)","v":0},{"$f":"VLOOKUP(A14,November!A:AA,20,FALSE)","v":0},{"$f":"VLOOKUP(A14,November!A:AB,26,FALSE)","v":""},{"$f":"VLOOKUP(A14,November!A:AC,25,FALSE)","v":0}]
["8.11.",{"$f":"VLOOKUP(A15,November!A:Z,2,FALSE)","v":"Mi"},{"$f":"VLOOKUP(A15,November!A:Y,21,FALSE)","v":0},{"$f":"VLOOKUP(A15,November!A:Z,17,FALSE)","v":0},{"$f":"VLOOKUP(A15,November!A:Z,18,FALSE)","v":0},{"$f":"VLOOKUP(A15,November!A:AA,20,FALSE)","v":0},{"$f":"VLOOKUP(A15,November!A:AB,26,FALSE)","v":""},{"$f":"VLOOKUP(A15,November!A:AC,25,FALSE)","v":0}]
["9.11.",{"$f":"VLOOKUP(A16,November!A:Z,2,FALSE)","v":"Do"},{"$f":"VLOOKUP(A16,November!A:Y,21,FALSE)","v":0},{"$f":"VLOOKUP(A16,November!A:Z,17,FALSE)","v":0},{"$f":"VLOOKUP(A16,November!A:Z,18,FALSE)","v":0},{"$f":"VLOOKUP(A16,November!A:AA,20,FALSE)","v":0},{"$f":"VLOOKUP(A16,November!A:AB,26,FALSE)","v":""},{"$f":"VLOOKUP(A16,November!A:AC,25,FALSE)","v":0}]
["10.11.",{"$f":"VLOOKUP(A17,November!A:Z,2,FALSE)","v":"Fr"},{"$f":"VLOOKUP(A17,November!A:Y,21,FALSE)","v":0},{"$f":"VLOOKUP(A17,November!A:Z,17,FALSE)","v":0},{"$f":"VLOOKUP(A17,November!A:Z,18,FALSE)","v":0},{"$f":"VLOOKUP(A17,November!A:AA,20,FALSE)","v":0},{"$f":"VLOOKUP(A17,November!A:AB,26,FALSE)","v":""},{"$f":"VLOOKUP(A17,November!A:AC,25,FALSE)","v":0}]
["11.11.",{"$f":"VLOOKUP(A18,November!A:Z,2,FALSE)","v":"Sa"},{"$f":"VLOOKUP(A18,November!A:Y,21,FALSE)","v":0},{"$f":"VLOOKUP(A18,November!A:Z,17,FALSE)","v":0},{"$f":"VLOOKUP(A18,November!A:Z,18,FALSE)","v":0},{"$f":"VLOOKUP(A18,November!A:AA,20,FALSE)","v":0},{"$f":"VLOOKUP(A18,November!A:AB,26,FALSE)","v":""},{"$f":"VLOOKUP(A18,November!A:AC,25,FALSE)","v":0}]
["12.11.",{"$f":"VLOOKUP(A19,November!A:Z,2,FALSE)","v":"So"},{"$f":"VLOOKUP(A19,November!A:Y,21,FALSE)","v":0},{"$f":"VLOOKUP(A19,November!A:Z,17,FALSE)","v":0},{"$f":"VLOOKUP(A19,November!A:Z,18,FALSE)","v":0},{"$f":"VLOOKUP(A19,November!A:AA,20,FALSE)","v":0},{"$f":"VLOOKUP(A19,November!A:AB,26,FALSE)","v":""},{"$f":"VLOOKUP(A19,November!A:AC,25,FALSE)","v":0}]
["13.11.",{"$f":"VLOOKUP(A20,November!A:Z,2,FALSE)","v":"Mo"},{"$f":"VLOOKUP(A20,November!A:Y,21,FALSE)","v":0},{"$f":"VLOOKUP(A20,November!A:Z,17,FALSE)","v":0},{"$f":"VLOOKUP(A20,November!A:Z,18,FALSE)","v":0},{"$f":"VLOOKUP(A20,November!A:AA,20,FALSE)","v":0},{"$f":"VLOOKUP(A20,November!A:AB,26,FALSE)","v":""},{"$f":"VLOOKUP(A20,November!A:AC,25,FALSE)","v":0}]
["14.11.",{"$f":"VLOOKUP(A21,November!A:Z,2,FALSE)","v":"Die"},{"$f":"VLOOKUP(A21,November!A:Y,21,FALSE)","v":0},{"$f":"VLOOKUP(A21,November!A:Z,17,FALSE)","v":0},{"$f":"VLOOKUP(A21,November!A:Z,18,FALSE)","v":0},{"$f":"VLOOKUP(A21,November!A:AA,20,FALSE)","v":0},{"$f":"VLOOKUP(A21,November!A:AB,26,FALSE)","v":""},{"$f":"VLOOKUP(A21,November!A:AC,25,FALSE)","v":0}]
["15.11.",{"$f":"VLOOKUP(A22,November!A:Z,2,FALSE)","v":"Mi"},{"$f":"VLOOKUP(A22,November!A:Y,21,FALSE)","v":0},{"$f":"VLOOKUP(A22,November!A:Z,17,FALSE)","v":0},{"$f":"VLOOKUP(A22,November!A:Z,18,FALSE)","v":0},{"$f":"VLOOKUP(A22,November!A:AA,20,FALSE)","v":0},{"$f":"VLOOKUP(A22,November!A:AB,26,FALSE)","v":""},{"$f":"VLOOKUP(A22,November!A:AC,25,FALSE)","v":0}]
["16.11.",{"$f":"VLOOKUP(A23,November!A:Z,2,FALSE)","v":"Do"},{"$f":"VLOOKUP(A23,November!A:Y,21,FALSE)","v":0},{"$f":"VLOOKUP(A23,November!A:Z,17,FALSE)","v":0},{"$f":"VLOOKUP(A23,November!A:Z,18,FALSE)","v":0},{"$f":"VLOOKUP(A23,November!A:AA,20,FALSE)","v":0},{"$f":"VLOOKUP(A23,November!A:AB,26,FALSE)","v":""},{"$f":"VLOOKUP(A23,November!A:AC,25,FALSE)","v":0}]
["17.11.",{"$f":"VLOOKUP(A24,November!A:Z,2,FALSE)","v":"Fr"},{"$f":"VLOOKUP(A24,November!A:Y,21,FALSE)","v":0},{"$f":"VLOOKUP(A24,November!A:Z,17,FALSE)","v":0},{"$f":"VLOOKUP(A24,November!A:Z,18,FALSE)","v":0},{"$f":"VLOOKUP(A24,November!A:AA,20,FALSE)","v":0},{"$f":"VLOOKUP(A24,November!A:AB,26,FALSE)","v":""},{"$f":"VLOOKUP(A24,November!A:AC,25,FALSE)","v":0}]
["18.11.",{"$f":"VLOOKUP(A25,November!A:Z,2,FALSE)","v":"Sa"},{"$f":"VLOOKUP(A25,November!A:Y,21,FALSE)","v":0},{"$f":"VLOOKUP(A25,November!A:Z,17,FALSE)","v":0},{"$f":"VLOOKUP(A25,November!A:Z,18,FALSE)","v":0},{"$f":"VLOOKUP(A25,November!A:AA,20,FALSE)","v":0},{"$f":"VLOOKUP(A25,November!A:AB,26,FALSE)","v":""},{"$f":"VLOOKUP(A25,November!A:AC,25,FALSE)","v":0}]
["19.11.",{"$f":"VLOOKUP(A26,November!A:Z,2,FALSE)","v":"So"},{"$f":"VLOOKUP(A26,November!A:Y,21,FALSE)","v":0},{"$f":"VLOOKUP(A26,November!A:Z,17,FALSE)","v":0},{"$f":"VLOOKUP(A26,November!A:Z,18,FALSE)","v":0},{"$f":"VLOOKUP(A26,November!A:AA,20,FALSE)","v":0},{"$f":"VLOOKUP(A26,November!A:AB,26,FALSE)","v":""},{"$f":"VLOOKUP(A26,November!A:AC,25,FALSE)","v":0}]
["20.11.",{"$f":"VLOOKUP(A27,November!A:Z,2,FALSE)","v":"Mo"},{"$f":"VLOOKUP(A27,November!A:Y,21,FALSE)","v":0},{"$f":"VLOOKUP(A27,November!A:Z,17,FALSE)","v":0},{"$f":"VLOOKUP(A27,November!A:Z,18,FALSE)","v":0},{"$f":"VLOOKUP(A27,November!A:AA,20,FALSE)","v":0},{"$f":"VLOOKUP(A27,November!A:AB,26,FALSE)","v":""},{"$f":"VLOOKUP(A27,November!A:AC,25,FALSE)","v":0}]
["21.11.",{"$f":"VLOOKUP(A28,November!A:Z,2,FALSE)","v":"Die"},{"$f":"VLOOKUP(A28,November!A:Y,21,FALSE)","v":0},{"$f":"VLOOKUP(A28,November!A:Z,17,FALSE)","v":0},{"$f":"VLOOKUP(A28,November!A:Z,18,FALSE)","v":0},{"$f":"VLOOKUP(A28,November!A:AA,20,FALSE)","v":0},{"$f":"VLOOKUP(A28,November!A:AB,26,FALSE)","v":""},{"$f":"VLOOKUP(A28,November!A:AC,25,FALSE)","v":0}]
["22.11.",{"$f":"VLOOKUP(A29,November!A:Z,2,FALSE)","v":"Mi"},{"$f":"VLOOKUP(A29,November!A:Y,21,FALSE)","v":0},{"$f":"VLOOKUP(A29,November!A:Z,17,FALSE)","v":0},{"$f":"VLOOKUP(A29,November!A:Z,18,FALSE)","v":0},{"$f":"VLOOKUP(A29,November!A:AA,20,FALSE)","v":0},{"$f":"VLOOKUP(A29,November!A:AB,26,FALSE)","v":""},{"$f":"VLOOKUP(A29,November!A:AC,25,FALSE)","v":0}]
["23.11.",{"$f":"VLOOKUP(A30,November!A:Z,2,FALSE)","v":"Do"},{"$f":"VLOOKUP(A30,November!A:Y,21,FALSE)","v":0},{"$f":"VLOOKUP(A30,November!A:Z,17,FALSE)","v":0},{"$f":"VLOOKUP(A30,November!A:Z,18,FALSE)","v":0},{"$f":"VLOOKUP(A30,November!A:AA,20,FALSE)","v":0},{"$f":"VLOOKUP(A30,November!A:AB,26,FALSE)","v":""},{"$f":"VLOOKUP(A30,November!A:AC,25,FALSE)","v":0}]
["24.11.",{"$f":"VLOOKUP(A31,November!A:Z,2,FALSE)","v":"Fr"},{"$f":"VLOOKUP(A31,November!A:Y,21,FALSE)","v":0},{"$f":"VLOOKUP(A31,November!A:Z,17,FALSE)","v":0},{"$f":"VLOOKUP(A31,November!A:Z,18,FALSE)","v":0},{"$f":"VLOOKUP(A31,November!A:AA,20,FALSE)","v":0},{"$f":"VLOOKUP(A31,November!A:AB,26,FALSE)","v":""},{"$f":"VLOOKUP(A31,November!A:AC,25,FALSE)","v":0}]
["25.11.",{"$f":"VLOOKUP(A32,November!A:Z,2,FALSE)","v":"Sa"},{"$f":"VLOOKUP(A32,November!A:Y,21,FALSE)","v":0},{"$f":"VLOOKUP(A32,November!A:Z,17,FALSE)","v":0},{"$f":"VLOOKUP(A32,November!A:Z,18,FALSE)","v":0},{"$f":"VLOOKUP(A32,November!A:AA,20,FALSE)","v":0},{"$f":"VLOOKUP(A32,November!A:AB,26,FALSE)","v":""},{"$f":"VLOOKUP(A32,November!A:AC,25,FALSE)","v":0}]
["26.11.",{"$f":"VLOOKUP(A33,November!A:Z,2,FALSE)","v":"So"},{"$f":"VLOOKUP(A33,November!A:Y,21,FALSE)","v":0},{"$f":"VLOOKUP(A33,November!A:Z,17,FALSE)","v":0},{"$f":"VLOOKUP(A33,November!A:Z,18,FALSE)","v":0},{"$f":"VLOOKUP(A33,November!A:AA,20,FALSE)","v":0},{"$f":"VLOOKUP(A33,November!A:AB,26,FALSE)","v":""},{"$f":"VLOOKUP(A33,November!A:AC,25,FALSE)","v":0}]
["27.11.",{"$f":"VLOOKUP(A34,November!A:Z,2,FALSE)","v":"Mo"},{"$f":"VLOOKUP(A34,November!A:Y,21,FALSE)","v":0},{"$f":"VLOOKUP(A34,November!A:Z,17,FALSE)","v":0},{"$f":"VLOOKUP(A34,November!A:Z,18,FALSE)","v":0},{"$f":"VLOOKUP(A34,November!A:AA,20,FALSE)","v":0},{"$f":"VLOOKUP(A34,November!A:AB,26,FALSE)","v":""},{"$f":"VLOOKUP(A34,November!A:AC,25,FALSE)","v":0}]
["28.11.",{"$f":"VLOOKUP(A35,November!A:Z,2,FALSE)","v":"Die"},{"$f":"VLOOKUP(A35,November!A:Y,21,FALSE)","v":0},{"$f":"VLOOKUP(A35,November!A:Z,17,FALSE)","v":0},{"$f":"VLOOKUP(A35,November!A:Z,18,FALSE)","v":0},{"$f":"VLOOKUP(A35,November!A:AA,20,FALSE)","v":0},{"$f":"VLOOKUP(A35,November!A:AB,26,FALSE)","v":""},{"$f":"VLOOKUP(A35,November!A:AC,25,FALSE)","v":0}]
["29.11.",{"$f":"VLOOKUP(A36,November!A:Z,2,FALSE)","v":"Mi"},{"$f":"VLOOKUP(A36,November!A:Y,21,FALSE)","v":0},{"$f":"VLOOKUP(A36,November!A:Z,17,FALSE)","v":0},{"$f":"VLOOKUP(A36,November!A:Z,18,FALSE)","v":0},{"$f":"VLOOKUP(A36,November!A:AA,20,FALSE)","v":0},{"$f":"VLOOKUP(A36,November!A:AB,26,FALSE)","v":""},{"$f":"VLOOKUP(A36,November!A:AC,25,FALSE)","v":0}]
["30.11.",{"$f":"VLOOKUP(A37,November!A:Z,2,FALSE)","v":"Do"},{"$f":"VLOOKUP(A37,November!A:Y,21,FALSE)","v":0},{"$f":"VLOOKUP(A37,November!A:Z,17,FALSE)","v":0},{"$f":"VLOOKUP(A37,November!A:Z,18,FALSE)","v":0},{"$f":"VLOOKUP(A37,November!A:AA,20,FALSE)","v":0},{"$f":"VLOOKUP(A37,November!A:AB,26,FALSE)","v":""},{"$f":"VLOOKUP(A37,November!A:AC,25,FALSE)","v":0}]
[]
["1) Die Anzeige von \"Fehler\" in Spalte G erscheint, wenn im Arbeitsblatt des entsprechenden Monats: 1. Arbeitszeit und Urlaub erfasst wurde;  2. Urlaub und Krankheit jeweils eingegeben wurde und wenn 3. in der Erfassungstabelle (Monat) an Krankheitstagen Arbeitszeit eingetragen wurde.    Hintergrund: Im Urlaub oder bei Krankheit kann nicht gearbeitet werden."]
["2) An Krankheitstagen erscheint in dieser Tabelle dennoch eine Zahl bei der Arbeitszeit. Krankheit wird in AZ umgerechnet und erhöht die IST-AZ.; Bei der \"Fehler\"anzeige wurde Arbeitszeit in den Spalten C bis O (Monatsblatt) eingetragen."]
[]
["Zum Arbeitsblatt:",null,null,"NOVEMBER"]

{"sheet":"Dezember-Druck","index":28,"n_rows":43,"n_cols":8,"rows_kept":43,"cut":false,"hidden":false,"merged":[[42,0,42,2],[42,3,42,4],[0,0,0,1],[2,6,5,6],[5,0,5,1],[39,0,39,7],[40,0,40,7]]}
[{"$f":"Dezember!V1","v":"DEZEMBER"},null,{"$f":"Stammdaten!C2","v":2023},null,null,null,null,{"$f":"Stammdaten!B3","v":0}]
["JAZ",null,{"$f":"Stammdaten!B26","v":1287}]
["Jahres-IST",null,{"$f":"Dezember!U5","v":0}]
["Verbleibende AZ",null,{"$f":"Dezember!W44","v":1287}]
["Urlaub im Monat",null,{"$f":"Dezember!Q45","v":0}]
["Resturlaub zum Ende des Monats",null,{"$f":"Dezember!Q5","v":30}]
["Datum","Tag","AZ","Urlaub","Krank/\nFreistellung","Ort","Plausibilität","Anmerkungen"]
["1.12.",{"$f":"VLOOKUP(A8,Dezember!A:Z,2,FALSE)","v":"Fr"},{"$f":"VLOOKUP(A8,Dezember!A:Y,21,FALSE)","v":0},{"$f":"VLOOKUP(A8,Dezember!A:Z,17,FALSE)","v":0},{"$f":"VLOOKUP(A8,Dezember!A:Z,18,FALSE)","v":0},{"$f":"VLOOKUP(A8,Dezember!A:AA,20,FALSE)","v":0},{"$f":"VLOOKUP(A8,Dezember!A:AB,26,FALSE)","v":""},{"$f":"VLOOKUP(A8,Dezember!A:AC,25,FALSE)","v":0}]
["2.12.",{"$f":"VLOOKUP(A9,Dezember!A:Z,2,FALSE)","v":"Sa"},{"$f":"VLOOKUP(A9,Dezember!A:Y,21,FALSE)","v":0},{"$f":"VLOOKUP(A9,Dezember!A:Z,17,FALSE)","v":0},{"$f":"VLOOKUP(A9,Dezember!A:Z,18,FALSE)","v":0},{"$f":"VLOOKUP(A9,Dezember!A:AA,20,FALSE)","v":0},{"$f":"VLOOKUP(A9,Dezember!A:AB,26,FALSE)","v":""},{"$f":"VLOOKUP(A9,Dezember!A:AC,25,FALSE)","v":0}]
["3.12.",{"$f":"VLOOKUP(A10,Dezember!A:Z,2,FALSE)","v":"So"},{"$f":"VLOOKUP(A10,Dezember!A:Y,21,FALSE)","v":0},{"$f":"VLOOKUP(A10,Dezember!A:Z,17,FALSE)","v":0},{"$f":"VLOOKUP(A10,Dezember!A:Z,18,FALSE)","v":0},{"$f":"VLOOKUP(A10,Dezember!A:AA,20,FALSE)","v":0},{"$f":"VLOOKUP(A10,Dezember!A:AB,26,FALSE)","v":""},{"$f":"VLOOKUP(A10,Dezember!A:AC,25,FALSE)","v":0}]
["4.12.",{"$f":"VLOOKUP(A11,Dezember!A:Z,2,FALSE)","v":"Mo"},{"$f":"VLOOKUP(A11,Dezember!A:Y,21,FALSE)","v":0},{"$f":"VLOOKUP(A11,Dezember!A:Z,17,FALSE)","v":0},{"$f":"VLOOKUP(A11,Dezember!A:Z,18,FALSE)","v":0},{"$f":"VLOOKUP(A11,Dezember!A:AA,20,FALSE)","v":0},{"$f":"VLOOKUP(A11,Dezember!A:AB,26,FALSE)","v":""},{"$f":"VLOOKUP(A11,Dezember!A:AC,25,FALSE)","v":0}]
["5.12.",{"$f":"VLOOKUP(A12,Dezember!A:Z,2,FALSE)","v":"Die"},{"$f":"VLOOKUP(A12,Dezember!A:Y,21,FALSE)","v":0},{"$f":"VLOOKUP(A12,Dezember!A:Z,17,FALSE)","v":0},{"$f":"VLOOKUP(A12,Dezember!A:Z,18,FALSE)","v":0},{"$f":"VLOOKUP(A12,Dezember!A:AA,20,FALSE)","v":0},{"$f":"VLOOKUP(A12,Dezember!A:AB,26,FALSE)","v":""},{"$f":"VLOOKUP(A12,Dezember!A:AC,25,FALSE)","v":0}]
["6.12.",{"$f":"VLOOKUP(A13,Dezember!A:Z,2,FALSE)","v":"Mi"},{"$f":"VLOOKUP(A13,Dezember!A:Y,21,FALSE)","v":0},{"$f":"VLOOKUP(A13,Dezember!A:Z,17,FALSE)","v":0},{"$f":"VLOOKUP(A13,Dezember!A:Z,18,FALSE)","v":0},{"$f":"VLOOKUP(A13,Dezember!A:AA,20,FALSE)","v":0},{"$f":"VLOOKUP(A13,Dezember!A:AB,26,FALSE)","v":""},{"$f":"VLOOKUP(A13,Dezember!A:AC,25,FALSE)","v":0}]
["7.12.",{"$f":"VLOOKUP(A14,Dezember!A:Z,2,FALSE)","v":"Do"},{"$f":"VLOOKUP(A14,Dezember!A:Y,21,FALSE)","v":0},{"$f":"VLOOKUP(A14,Dezember!A:Z,17,FALSE)","v":0},{"$f":"VLOOKUP(A14,Dezember!A:Z,18,FALSE)","v":0},{"$f":"VLOOKUP(A14,Dezember!A:AA,20,FALSE)","v":0},{"$f":"VLOOKUP(A14,Dezember!A:AB,26,FALSE)","v":""},{"$f":"VLOOKUP(A14,Dezember!A:AC,25,FALSE)","v":0}]
["8.12.",{"$f":"VLOOKUP(A15,Dezember!A:Z,2,FALSE)","v":"Fr"},{"$f":"VLOOKUP(A15,Dezember!A:Y,21,FALSE)","v":0},{"$f":"VLOOKUP(A15,Dezember!A:Z,17,FALSE)","v":0},{"$f":"VLOOKUP(A15,Dezember!A:Z,18,FALSE)","v":0},{"$f":"VLOOKUP(A15,Dezember!A:AA,20,FALSE)","v":0},{"$f":"VLOOKUP(A15,Dezember!A:AB,26,FALSE)","v":""},{"$f":"VLOOKUP(A15,Dezember!A:AC,25,FALSE)","v":0}]
["9.12.",{"$f":"VLOOKUP(A16,Dezember!A:Z,2,FALSE)","v":"Sa"},{"$f":"VLOOKUP(A16,Dezember!A:Y,21,FALSE)","v":0},{"$f":"VLOOKUP(A16,Dezember!A:Z,17,FALSE)","v":0},{"$f":"VLOOKUP(A16,Dezember!A:Z,18,FALSE)","v":0},{"$f":"VLOOKUP(A16,Dezember!A:AA,20,FALSE)","v":0},{"$f":"VLOOKUP(A16,Dezember!A:AB,26,FALSE)","v":""},{"$f":"VLOOKUP(A16,Dezember!A:AC,25,FALSE)","v":0}]
["10.12.",{"$f":"VLOOKUP(A17,Dezember!A:Z,2,FALSE)","v":"So"},{"$f":"VLOOKUP(A17,Dezember!A:Y,21,FALSE)","v":0},{"$f":"VLOOKUP(A17,Dezember!A:Z,17,FALSE)","v":0},{"$f":"VLOOKUP(A17,Dezember!A:Z,18,FALSE)","v":0},{"$f":"VLOOKUP(A17,Dezember!A:AA,20,FALSE)","v":0},{"$f":"VLOOKUP(A17,Dezember!A:AB,26,FALSE)","v":""},{"$f":"VLOOKUP(A17,Dezember!A:AC,25,FALSE)","v":0}]
["11.12.",{"$f":"VLOOKUP(A18,Dezember!A:Z,2,FALSE)","v":"Mo"},{"$f":"VLOOKUP(A18,Dezember!A:Y,21,FALSE)","v":0},{"$f":"VLOOKUP(A18,Dezember!A:Z,17,FALSE)","v":0},{"$f":"VLOOKUP(A18,Dezember!A:Z,18,FALSE)","v":0},{"$f":"VLOOKUP(A18,Dezember!A:AA,20,FALSE)","v":0},{"$f":"VLOOKUP(A18,Dezember!A:AB,26,FALSE)","v":""},{"$f":"VLOOKUP(A18,Dezember!A:AC,25,FALSE)","v":0}]
["12.12.",{"$f":"VLOOKUP(A19,Dezember!A:Z,2,FALSE)","v":"Die"},{"$f":"VLOOKUP(A19,Dezember!A:Y,21,FALSE)","v":0},{"$f":"VLOOKUP(A19,Dezember!A:Z,17,FALSE)","v":0},{"$f":"VLOOKUP(A19,Dezember!A:Z,18,FALSE)","v":0},{"$f":"VLOOKUP(A19,Dezember!A:AA,20,FALSE)","v":0},{"$f":"VLOOKUP(A19,Dezember!A:AB,26,FALSE)","v":""},{"$f":"VLOOKUP(A19,Dezember!A:AC,25,FALSE)","v":0}]
["13.12.",{"$f":"VLOOKUP(A20,Dezember!A:Z,2,FALSE)","v":"Mi"},{"$f":"VLOOKUP(A20,Dezember!A:Y,21,FALSE)","v":0},{"$f":"VLOOKUP(A20,Dezember!A:Z,17,FALSE)","v":0},{"$f":"VLOOKUP(A20,Dezember!A:Z,18,FALSE)","v":0},{"$f":"VLOOKUP(A20,Dezember!A:AA,20,FALSE)","v":0},{"$f":"VLOOKUP(A20,Dezember!A:AB,26,FALSE)","v":""},{"$f":"VLOOKUP(A20,Dezember!A:AC,25,FALSE)","v":0}]
["14.12.",{"$f":"VLOOKUP(A21,Dezember!A:Z,2,FALSE)","v":"Do"},{"$f":"VLOOKUP(A21,Dezember!A:Y,21,FALSE)","v":0},{"$f":"VLOOKUP(A21,Dezember!A:Z,17,FALSE)","v":0},{"$f":"VLOOKUP(A21,Dezember!A:Z,18,FALSE)","v":0},{"$f":"VLOOKUP(A21,Dezember!A:AA,20,FALSE)","v":0},{"$f":"VLOOKUP(A21,Dezember!A:AB,26,FALSE)","v":""},{"$f":"VLOOKUP(A21,Dezember!A:AC,25,FALSE)","v":0}]
["15.12.",{"$f":"VLOOKUP(A22,Dezember!A:Z,2,FALSE)","v":"Fr"},{"$f":"VLOOKUP(A22,Dezember!A:Y,21,FALSE)","v":0},{"$f":"VLOOKUP(A22,Dezember!A:Z,17,FALSE)","v":0},{"$f":"VLOOKUP(A22,Dezember!A:Z,18,FALSE)","v":0},{"$f":"VLOOKUP(A22,Dezember!A:AA,20,FALSE)","v":0},{"$f":"VLOOKUP(A22,Dezember!A:AB,26,FALSE)","v":""},{"$f":"VLOOKUP(A22,Dezember!A:AC,25,FALSE)","v":0}]
["16.12.",{"$f":"VLOOKUP(A23,Dezember!A:Z,2,FALSE)","v":"Sa"},{"$f":"VLOOKUP(A23,Dezember!A:Y,21,FALSE)","v":0},{"$f":"VLOOKUP(A23,Dezember!A:Z,17,FALSE)","v":0},{"$f":"VLOOKUP(A23,Dezember!A:Z,18,FALSE)","v":0},{"$f":"VLOOKUP(A23,Dezember!A:AA,20,FALSE)","v":0},{"$f":"VLOOKUP(A23,Dezember!A:AB,26,FALSE)","v":""},{"$f":"VLOOKUP(A23,Dezember!A:AC,25,FALSE)","v":0}]
["17.12.",{"$f":"VLOOKUP(A24,Dezember!A:Z,2,FALSE)","v":"So"},{"$f":"VLOOKUP(A24,Dezember!A:Y,21,FALSE)","v":0},{"$f":"VLOOKUP(A24,Dezember!A:Z,17,FALSE)","v":0},{"$f":"VLOOKUP(A24,Dezember!A:Z,18,FALSE)","v":0},{"$f":"VLOOKUP(A24,Dezember!A:AA,20,FALSE)","v":0},{"$f":"VLOOKUP(A24,Dezember!A:AB,26,FALSE)","v":""},{"$f":"VLOOKUP(A24,Dezember!A:AC,25,FALSE)","v":0}]
["18.12.",{"$f":"VLOOKUP(A25,Dezember!A:Z,2,FALSE)","v":"Mo"},{"$f":"VLOOKUP(A25,Dezember!A:Y,21,FALSE)","v":0},{"$f":"VLOOKUP(A25,Dezember!A:Z,17,FALSE)","v":0},{"$f":"VLOOKUP(A25,Dezember!A:Z,18,FALSE)","v":0},{"$f":"VLOOKUP(A25,Dezember!A:AA,20,FALSE)","v":0},{"$f":"VLOOKUP(A25,Dezember!A:AB,26,FALSE)","v":""},{"$f":"VLOOKUP(A25,Dezember!A:AC,25,FALSE)","v":0}]
["19.12.",{"$f":"VLOOKUP(A26,Dezember!A:Z,2,FALSE)","v":"Die"},{"$f":"VLOOKUP(A26,Dezember!A:Y,21,FALSE)","v":0},{"$f":"VLOOKUP(A26,Dezember!A:Z,17,FALSE)","v":0},{"$f":"VLOOKUP(A26,Dezember!A:Z,18,FALSE)","v":0},{"$f":"VLOOKUP(A26,Dezember!A:AA,20,FALSE)","v":0},{"$f":"VLOOKUP(A26,Dezember!A:AB,26,FALSE)","v":""},{"$f":"VLOOKUP(A26,Dezember!A:AC,25,FALSE)","v":0}]
["20.12.",{"$f":"VLOOKUP(A27,Dezember!A:Z,2,FALSE)","v":"Mi"},{"$f":"VLOOKUP(A27,Dezember!A:Y,21,FALSE)","v":0},{"$f":"VLOOKUP(A27,Dezember!A:Z,17,FALSE)","v":0},{"$f":"VLOOKUP(A27,Dezember!A:Z,18,FALSE)","v":0},{"$f":"VLOOKUP(A27,Dezember!A:AA,20,FALSE)","v":0},{"$f":"VLOOKUP(A27,Dezember!A:AB,26,FALSE)","v":""},{"$f":"VLOOKUP(A27,Dezember!A:AC,25,FALSE)","v":0}]
["21.12.",{"$f":"VLOOKUP(A28,Dezember!A:Z,2,FALSE)","v":"Do"},{"$f":"VLOOKUP(A28,Dezember!A:Y,21,FALSE)","v":0},{"$f":"VLOOKUP(A28,Dezember!A:Z,17,FALSE)","v":0},{"$f":"VLOOKUP(A28,Dezember!A:Z,18,FALSE)","v":0},{"$f":"VLOOKUP(A28,Dezember!A:AA,20,FALSE)","v":0},{"$f":"VLOOKUP(A28,Dezember!A:AB,26,FALSE)","v":""},{"$f":"VLOOKUP(A28,Dezember!A:AC,25,FALSE)","v":0}]
["22.12.",{"$f":"VLOOKUP(A29,Dezember!A:Z,2,FALSE)","v":"Fr"},{"$f":"VLOOKUP(A29,Dezember!A:Y,21,FALSE)","v":0},{"$f":"VLOOKUP(A29,Dezember!A:Z,17,FALSE)","v":0},{"$f":"VLOOKUP(A29,Dezember!A:Z,18,FALSE)","v":0},{"$f":"VLOOKUP(A29,Dezember!A:AA,20,FALSE)","v":0},{"$f":"VLOOKUP(A29,Dezember!A:AB,26,FALSE)","v":""},{"$f":"VLOOKUP(A29,Dezember!A:AC,25,FALSE)","v":0}]
["23.12.",{"$f":"VLOOKUP(A30,Dezember!A:Z,2,FALSE)","v":"Sa"},{"$f":"VLOOKUP(A30,Dezember!A:Y,21,FALSE)","v":0},{"$f":"VLOOKUP(A30,Dezember!A:Z,17,FALSE)","v":0},{"$f":"VLOOKUP(A30,Dezember!A:Z,18,FALSE)","v":0},{"$f":"VLOOKUP(A30,Dezember!A:AA,20,FALSE)","v":0},{"$f":"VLOOKUP(A30,Dezember!A:AB,26,FALSE)","v":""},{"$f":"VLOOKUP(A30,Dezember!A:AC,25,FALSE)","v":0}]
["24.12.",{"$f":"VLOOKUP(A31,Dezember!A:Z,2,FALSE)","v":"So"},{"$f":"VLOOKUP(A31,Dezember!A:Y,21,FALSE)","v":0},{"$f":"VLOOKUP(A31,Dezember!A:Z,17,FALSE)","v":0},{"$f":"VLOOKUP(A31,Dezember!A:Z,18,FALSE)","v":0},{"$f":"VLOOKUP(A31,Dezember!A:AA,20,FALSE)","v":0},{"$f":"VLOOKUP(A31,Dezember!A:AB,26,FALSE)","v":""},{"$f":"VLOOKUP(A31,Dezember!A:AC,25,FALSE)","v":0}]
["25.12.",{"$f":"VLOOKUP(A32,Dezember!A:Z,2,FALSE)","v":"Mo"},{"$f":"VLOOKUP(A32,Dezember!A:Y,21,FALSE)","v":0},{"$f":"VLOOKUP(A32,Dezember!A:Z,17,FALSE)","v":0},{"$f":"VLOOKUP(A32,Dezember!A:Z,18,FALSE)","v":0},{"$f":"VLOOKUP(A32,Dezember!A:AA,20,FALSE)","v":0},{"$f":"VLOOKUP(A32,Dezember!A:AB,26,FALSE)","v":""},{"$f":"VLOOKUP(A32,Dezember!A:AC,25,FALSE)","v":0}]
["26.12.",{"$f":"VLOOKUP(A33,Dezember!A:Z,2,FALSE)","v":"Die"},{"$f":"VLOOKUP(A33,Dezember!A:Y,21,FALSE)","v":0},{"$f":"VLOOKUP(A33,Dezember!A:Z,17,FALSE)","v":0},{"$f":"VLOOKUP(A33,Dezember!A:Z,18,FALSE)","v":0},{"$f":"VLOOKUP(A33,Dezember!A:AA,20,FALSE)","v":0},{"$f":"VLOOKUP(A33,Dezember!A:AB,26,FALSE)","v":""},{"$f":"VLOOKUP(A33,Dezember!A:AC,25,FALSE)","v":0}]
["27.12.",{"$f":"VLOOKUP(A34,Dezember!A:Z,2,FALSE)","v":"Mi"},{"$f":"VLOOKUP(A34,Dezember!A:Y,21,FALSE)","v":0},{"$f":"VLOOKUP(A34,Dezember!A:Z,17,FALSE)","v":0},{"$f":"VLOOKUP(A34,Dezember!A:Z,18,FALSE)","v":0},{"$f":"VLOOKUP(A34,Dezember!A:AA,20,FALSE)","v":0},{"$f":"VLOOKUP(A34,Dezember!A:AB,26,FALSE)","v":""},{"$f":"VLOOKUP(A34,Dezember!A:AC,25,FALSE)","v":0}]
["28.12.",{"$f":"VLOOKUP(A35,Dezember!A:Z,2,FALSE)","v":"Do"},{"$f":"VLOOKUP(A35,Dezember!A:Y,21,FALSE)","v":0},{"$f":"VLOOKUP(A35,Dezember!A:Z,17,FALSE)","v":0},{"$f":"VLOOKUP(A35,Dezember!A:Z,18,FALSE)","v":0},{"$f":"VLOOKUP(A35,Dezember!A:AA,20,FALSE)","v":0},{"$f":"VLOOKUP(A35,Dezember!A:AB,26,FALSE)","v":""},{"$f":"VLOOKUP(A35,Dezember!A:AC,25,FALSE)","v":0}]
["29.12.",{"$f":"VLOOKUP(A36,Dezember!A:Z,2,FALSE)","v":"Fr"},{"$f":"VLOOKUP(A36,Dezember!A:Y,21,FALSE)","v":0},{"$f":"VLOOKUP(A36,Dezember!A:Z,17,FALSE)","v":0},{"$f":"VLOOKUP(A36,Dezember!A:Z,18,FALSE)","v":0},{"$f":"VLOOKUP(A36,Dezember!A:AA,20,FALSE)","v":0},{"$f":"VLOOKUP(A36,Dezember!A:AB,26,FALSE)","v":""},{"$f":"VLOOKUP(A36,Dezember!A:AC,25,FALSE)","v":0}]
["30.12.",{"$f":"VLOOKUP(A37,Dezember!A:Z,2,FALSE)","v":"Sa"},{"$f":"VLOOKUP(A37,Dezember!A:Y,21,FALSE)","v":0},{"$f":"VLOOKUP(A37,Dezember!A:Z,17,FALSE)","v":0},{"$f":"VLOOKUP(A37,Dezember!A:Z,18,FALSE)","v":0},{"$f":"VLOOKUP(A37,Dezember!A:AA,20,FALSE)","v":0},{"$f":"VLOOKUP(A37,Dezember!A:AB,26,FALSE)","v":""},{"$f":"VLOOKUP(A37,Dezember!A:AC,25,FALSE)","v":0}]
["31.12.",{"$f":"VLOOKUP(A38,Dezember!A:Z,2,FALSE)","v":"So"},{"$f":"VLOOKUP(A38,Dezember!A:Y,21,FALSE)","v":0},{"$f":"VLOOKUP(A38,Dezember!A:Z,17,FALSE)","v":0},{"$f":"VLOOKUP(A38,Dezember!A:Z,18,FALSE)","v":0},{"$f":"VLOOKUP(A38,Dezember!A:AA,20,FALSE)","v":0},{"$f":"VLOOKUP(A38,Dezember!A:AB,26,FALSE)","v":""},{"$f":"VLOOKUP(A38,Dezember!A:AC,25,FALSE)","v":0}]
[]
["1) Die Anzeige von \"Fehler\" in Spalte G erscheint, wenn im Arbeitsblatt des entsprechenden Monats: 1. Arbeitszeit und Urlaub erfasst wurde;  2. Urlaub und Krankheit jeweils eingegeben wurde und wenn 3. in der Erfassungstabelle (Monat) an Krankheitstagen Arbeitszeit eingetragen wurde.    Hintergrund: Im Urlaub oder bei Krankheit kann nicht gearbeitet werden."]
["2) An Krankheitstagen erscheint in dieser Tabelle dennoch eine Zahl bei der Arbeitszeit. Krankheit wird in AZ umgerechnet und erhöht die IST-AZ.; Bei der \"Fehler\"anzeige wurde Arbeitszeit in den Spalten C bis O (Monatsblatt) eingetragen."]
[]
["Zum Arbeitsblatt:",null,null,"DEZEMBER"]

{"sheet":"INTERN","index":29,"n_rows":73,"n_cols":12,"rows_kept":73,"cut":false,"hidden":true,"merged":[]}
[39]
[100]
[12]
[1]
[]
[]
[]
[]
["Datum",null,"Woche-Mo","Woche-Di","Woche-Mi","Woch-Do","Woche-Fr","Woche-Sa","Woche-So"]
["1.",null,"Mo","Di","Mi","Do","Fr","Sa","So",null,null,"1."]
["2.",null,"Di","Mi","Do","Fr","Sa","So","Sa",null,null,"2."]
["3.",null,"Mi","Do","Fr","Sa","So","Mo","So",null,null,"3."]
["4.",null,"Do","Fr","Sa","So","Mo","Di","Mo",null,null,"4."]
["5.",null,"Fr","Sa","So","Mo","Di","Mi","Di",null,null,"5."]
["6.",null,"Sa","So","Mo","Di","Mi","Do","Mi",null,null,"6."]
["7.",null,"So","Mo","Di","Mi","Do","Fr","Do",null,null,"7."]
["8.",null,"Mo","Di","Mi","Do","Fr","Sa","Fr",null,null,"8."]
["9.",null,"Di","Mi","Do","Fr","Sa","So","Sa",null,null,"9."]
["10.",null,"Mi","Do","Fr","Sa","So","Mo","So",null,null,"10."]
["11.",null,"Do","Fr","Sa","So","Mo","Di","Mo",null,null,"11."]
["12.",null,"Fr","Sa","So","Mo","Di","Mi","Di",null,null,"12."]
["13.",null,"Sa","So","Mo","Di","Mi","Do","Mi"]
["14.",null,"So","Mo","Di","Mi","Do","Fr","Do"]
["15.",null,"Mo","Di","Mi","Do","Fr","Sa","Fr"]
["16.",null,"Di","Mi","Do","Fr","Sa","So","Sa"]
["17.",null,"Mi","Do","Fr","Sa","So","Mo","So"]
["18.",null,"Do","Fr","Sa","So","Mo","Di","Mo"]
["19.",null,"Fr","Sa","So","Mo","Di","Mi","Di"]
["20.",null,"Sa","So","Mo","Di","Mi","Do","Mi"]
["21.",null,"So","Mo","Di","Mi","Do","Fr","Do"]
["22.",null,"Mo","Di","Mi","Do","Fr","Sa","Fr"]
["23.",null,"Di","Mi","Do","Fr","Sa","So","Sa"]
["24.",null,"Mi","Do","Fr","Sa","So","Mo","So"]
["25.",null,"Do","Fr","Sa","So","Mo","Di","Mo"]
["26.",null,"Fr","Sa","So","Mo","Di","Mi","Di"]
["27.",null,"Sa","So","Mo","Di","Mi","Do","Mi"]
["28.",null,"So","Mo","Di","Mi","Do","Fr","Do"]
["29.",null,"Mo","Di","Mi","Do","Fr","Sa","Fr"]
["30.",null,"Di","Mi","Do","Fr","Sa","So","Sa"]
["31.",null,"Mi","Do","Fr","Sa","So","Mo","So"]
[]
["Jan","Feb","März","April","Mai","Juni","Juli","August","September","Oktober","November ","Dezember"]
[{"$f":"CONCATENATE($A10,$L$10)","v":"1.1."},{"$f":"CONCATENATE($A10,$L$11)","v":"1.2."},{"$f":"CONCATENATE($A10,$L$12)","v":"1.3."},{"$f":"CONCATENATE($A10,$L$13)","v":"1.4."},{"$f":"CONCATENATE($A10,$L$14)","v":"1.5."},{"$f":"CONCATENATE($A10,$L$15)","v":"1.6."},{"$f":"CONCATENATE($A10,$L$16)","v":"1.7."},{"$f":"CONCATENATE($A10,$L$17)","v":"1.8."},{"$f":"CONCATENATE($A10,$L$18)","v":"1.9."},{"$f":"CONCATENATE($A10,$L$19)","v":"1.10."},{"$f":"CONCATENATE($A10,$L$20)","v":"1.11."},{"$f":"CONCATENATE($A10,$L$21)","v":"1.12."}]
[{"$f":"CONCATENATE($A11,$L$10)","v":"2.1."},{"$f":"CONCATENATE($A11,$L$11)","v":"2.2."},{"$f":"CONCATENATE($A11,$L$12)","v":"2.3."},{"$f":"CONCATENATE($A11,$L$13)","v":"2.4."},{"$f":"CONCATENATE($A11,$L$14)","v":"2.5."},{"$f":"CONCATENATE($A11,$L$15)","v":"2.6."},{"$f":"CONCATENATE($A11,$L$16)","v":"2.7."},{"$f":"CONCATENATE($A11,$L$17)","v":"2.8."},{"$f":"CONCATENATE($A11,$L$18)","v":"2.9."},{"$f":"CONCATENATE($A11,$L$19)","v":"2.10."},{"$f":"CONCATENATE($A11,$L$20)","v":"2.11."},{"$f":"CONCATENATE($A11,$L$21)","v":"2.12."}]
["3.1.","3.2.","3.3.","3.4.","3.5.","3.6.","3.7.","3.8.","3.9.","3.10.","3.11.","3.12."]
["4.1.","4.2.","4.3.","4.4.","4.5.","4.6.","4.7.","4.8.","4.9.","4.10.","4.11.","4.12."]
["5.1.","5.2.","5.3.","5.4.","5.5.","5.6.","5.7.","5.8.","5.9.","5.10.","5.11.","5.12."]
["6.1.","6.2.","6.3.","6.4.","6.5.","6.6.","6.7.","6.8.","6.9.","6.10.","6.11.","6.12."]
["7.1.","7.2.","7.3.","7.4.","7.5.","7.6.","7.7.","7.8.","7.9.","7.10.","7.11.","7.12."]
["8.1.","8.2.","8.3.","8.4.","8.5.","8.6.","8.7.","8.8.","8.9.","8.10.","8.11.","8.12."]
["9.1.","9.2.","9.3.","9.4.","9.5.","9.6.","9.7.","9.8.","9.9.","9.10.","9.11.","9.12."]
["10.1.","10.2.","10.3.","10.4.","10.5.","10.6.","10.7.","10.8.","10.9.","10.10.","10.11.","10.12."]
["11.1.","11.2.","11.3.","11.4.","11.5.","11.6.","11.7.","11.8.","11.9.","11.10.","11.11.","11.12."]
["12.1.","12.2.","12.3.","12.4.","12.5.","12.6.","12.7.","12.8.","12.9.","12.10.","12.11.","12.12."]
["13.1.","13.2.","13.3.","13.4.","13.5.","13.6.","13.7.","13.8.","13.9.","13.10.","13.11.","13.12."]
["14.1.","14.2.","14.3.","14.4.","14.5.","14.6.","14.7.","14.8.","14.9.","14.10.","14.11.","14.12."]
["15.1.","15.2.","15.3.","15.4.","15.5.","15.6.","15.7.","15.8.","15.9.","15.10.","15.11.","15.12."]
["16.1.","16.2.","16.3.","16.4.","16.5.","16.6.","16.7.","16.8.","16.9.","16.10.","16.11.","16.12."]
["17.1.","17.2.","17.3.","17.4.","17.5.","17.6.","17.7.","17.8.","17.9.","17.10.","17.11.","17.12."]
["18.1.","18.2.","18.3.","18.4.","18.5.","18.6.","18.7.","18.8.","18.9.","18.10.","18.11.","18.12."]
["19.1.","19.2.","19.3.","19.4.","19.5.","19.6.","19.7.","19.8.","19.9.","19.10.","19.11.","19.12."]
["20.1.","20.2.","20.3.","20.4.","20.5.","20.6.","20.7.","20.8.","20.9.","20.10.","20.11.","20.12."]
["21.1.","21.2.","21.3.","21.4.","21.5.","21.6.","21.7.","21.8.","21.9.","21.10.","21.11.","21.12."]
["22.1.","22.2.","22.3.","22.4.","22.5.","22.6.","22.7.","22.8.","22.9.","22.10.","22.11.","22.12."]
["23.1.","23.2.","23.3.","23.4.","23.5.","23.6.","23.7.","23.8.","23.9.","23.10.","23.11.","23.12."]
["24.1.","24.2.","24.3.","24.4.","24.5.","24.6.","24.7.","24.8.","24.9.","24.10.","24.11.","24.12."]
["25.1.","25.2.","25.3.","25.4.","25.5.","25.6.","25.7.","25.8.","25.9.","25.10.","25.11.","25.12."]
["26.1.","26.2.","26.3.","26.4.","26.5.","26.6.","26.7.","26.8.","26.9.","26.10.","26.11.","26.12."]
["27.1.","27.2.","27.3.","27.4.","27.5.","27.6.","27.7.","27.8.","27.9.","27.10.","27.11.","27.12."]
["28.1.","28.2.","28.3.","28.4.","28.5.","28.6.","28.7.","28.8.","28.9.","28.10.","28.11.","28.12."]
["29.1.","29.2.","29.3.","29.4.","29.5.","29.6.","29.7.","29.8.","29.9.","29.10.","29.11.","29.12."]
["30.1.",null,"30.3.","30.4.","30.5.","30.6.","30.7.","30.8.","30.9.","30.10.","30.11.","30.12."]
["31.1.",null,"31.3.",null,"31.5.",null,"31.7.","31.8.",null,"31.10.",null,"31.12."]